Bug 1411 - x32: strace build fails
Summary: x32: strace build fails
Status: RESOLVED WORKSFORME
Alias: None
Product: OE-Core
Classification: Build System, Metadata & Runtime
Component: core (show other bugs)
Version: unspecified
Hardware: x86 x86_64
: Medium normal
Target Milestone: 1.2
Assignee: Nitin Kamble
QA Contact:
URL:
Whiteboard:
Depends on:
Blocks: 1579
  Show dependency tree
 
Reported: 2011-08-25 14:35 UTC by Nitin Kamble
Modified: 2021-08-17 10:54 UTC (History)
4 users (show)

See Also:
OS type for building Yocto: ---
Type of Regression: ---
Verified:
Documentation change: ---


Attachments

Note You need to log in before you can comment on or make changes to this bug.
Description Nitin Kamble 2011-08-25 14:35:42 UTC
ERROR: Logfile of failure stored in: /disk0/pokybuild/build-multilib-x32-qemu/tmp/work/x86_64-x32-poky-linux-gnux32/strace-4.5.20-r2/temp/log.do_compile.7466
Log data follows:
| DEBUG: SITE files ['endian-little', 'common-linux', 'common-glibc', 'bit-32', 'ix86-common', 'x86_64-linux-gnux32', 'common']
| NOTE: make -j 16
| make  all-am
| make[1]: Entering directory `/disk0/pokybuild/build-multilib-x32-qemu/tmp/work/x86_64-x32-poky-linux-gnux32/strace-4.5.20-r2/strace-4.5.20'
| ccache x86_64-poky-linux-gnux32-gcc   -mx32  --sysroot=/disk0/pokybuild/build-multilib-x32-qemu/tmp/sysroots/qemux86-64 -DHAVE_CONFIG_H -I. -I./linux/x86_64 -I./linux   -Wall -O2 -pipe -g -feliminate-unused-debug-types -MT syscall.o -MD -MP -MF .deps/syscall.Tpo -c -o syscall.o syscall.c
| In file included from ./linux/x86_64/syscallent1.h:7:0,
|                  from syscall.c:121:
| ./linux/i386/syscallent.h:133:37: error: '__NR_socketcall' undeclared here (not in a function)
| ./linux/i386/syscallent.h:148:28: error: '__NR_ipc' undeclared here (not in a function)
| make[1]: *** [syscall.o] Error 1
| make[1]: Leaving directory `/disk0/pokybuild/build-multilib-x32-qemu/tmp/work/x86_64-x32-poky-linux-gnux32/strace-4.5.20-r2/strace-4.5.20'
| make: *** [all] Error 2
| ERROR: oe_runmake failed
| ERROR: Function 'do_compile' failed (see /disk0/pokybuild/build-multilib-x32-qemu/tmp/work/x86_64-x32-poky-linux-gnux32/strace-4.5.20-r2/temp/log.do_compile.7466 for further information)
Comment 1 Nitin Kamble 2011-12-01 14:36:28 UTC
This issue is not present with the latest meta-x32 layer.
nitin
Comment 2 Frans Meulenbroeks 2021-08-17 10:54:38 UTC
*** Bug 14514 has been marked as a duplicate of this bug. ***