Bug 14238 - nativesdk-glibc patch not applying
Summary: nativesdk-glibc patch not applying
Status: RESOLVED NOTABUG
Alias: None
Product: OE-Core
Classification: Build System, Metadata & Runtime
Component: core (show other bugs)
Version: 3.2.3
Hardware: x86 Multiple
: Undecided normal
Target Milestone: ---
Assignee: Anuj Mittal
QA Contact:
URL:
Whiteboard:
Depends on:
Blocks:
 
Reported: 2021-02-18 19:34 UTC by Jagadheesan
Modified: 2021-02-19 12:50 UTC (History)
2 users (show)

See Also:
OS type for building Yocto: ---
Type of Regression: ---
Verified:
Documentation change: Don't know


Attachments

Note You need to log in before you can comment on or make changes to this bug.
Description Jagadheesan 2021-02-18 19:34:01 UTC
https://autobuilder.yoctoproject.org/typhoon/#/builders/20/builds/3395/steps/10/logs/step1b

ERROR: nativesdk-glibc-2.32-r0 do_patch: Command Error: 'quilt --quiltrc /home/pokybuild/yocto-worker/buildtools/build/build/tmp/work/x86_64-nativesdk-pokysdk-linux/nativesdk-glibc/2.32-r0/recipe-sysroot-native/etc/quiltrc push' exited with 0  Output:
stdout: Applying patch faccessat2-perm.patch
patching file sysdeps/unix/sysv/linux/faccessat.c
Hunk #1 FAILED at 34.
1 out of 1 hunk FAILED -- rejects in file sysdeps/unix/sysv/linux/faccessat.c
Patch faccessat2-perm.patch does not apply (enforce with -f)


https://autobuilder.yoctoproject.org/typhoon/#/builders/20/builds/3395/steps/10/logs/step2b

ERROR: nativesdk-glibc-2.32-r0 do_patch: Command Error: 'quilt --quiltrc /home/pokybuild/yocto-worker/buildtools/build/build/tmp/work/i686-nativesdk-pokysdk-linux/nativesdk-glibc/2.32-r0/recipe-sysroot-native/etc/quiltrc push' exited with 0  Output:
stdout: Applying patch faccessat2-perm.patch
patching file sysdeps/unix/sysv/linux/faccessat.c
Hunk #1 FAILED at 34.
1 out of 1 hunk FAILED -- rejects in file sysdeps/unix/sysv/linux/faccessat.c
Patch faccessat2-perm.patch does not apply (enforce with -f)


https://autobuilder.yoctoproject.org/typhoon/#/builders/20/builds/3395/steps/10/logs/step3b

ERROR: nativesdk-glibc-2.32-r0 do_patch: Command Error: 'quilt --quiltrc /home/pokybuild/yocto-worker/buildtools/build/build/tmp/work/aarch64-nativesdk-pokysdk-linux/nativesdk-glibc/2.32-r0/recipe-sysroot-native/etc/quiltrc push' exited with 0  Output:
stdout: Applying patch faccessat2-perm.patch
patching file sysdeps/unix/sysv/linux/faccessat.c
Hunk #1 FAILED at 34.
1 out of 1 hunk FAILED -- rejects in file sysdeps/unix/sysv/linux/faccessat.c
Patch faccessat2-perm.patch does not apply (enforce with -f)
Comment 1 Anuj Mittal 2021-02-19 07:26:18 UTC
Thank you for checking the build I had started. Sorry, I forgot to deselect SWAT flag while starting the build.

I was testing some WIP patches for gatesgarth and had resolved this problem in a later build. So, closing this.
Comment 2 Jagadheesan 2021-02-19 12:50:09 UTC
No problem. Thanks.