Bug 14359 - qemumips64 failed to shutdown
Summary: qemumips64 failed to shutdown
Status: RESOLVED DUPLICATE of bug 14128
Alias: None
Product: OE-Core
Classification: Build System, Metadata & Runtime
Component: core (show other bugs)
Version: 3.3
Hardware: x86 Multiple
: Medium+ normal
Target Milestone: 3.4 M1
Assignee: Unassigned
QA Contact:
URL:
Whiteboard: AB-INT
Depends on:
Blocks:
 
Reported: 2021-04-23 08:31 UTC by Naveen Saini
Modified: 2025-02-14 16:48 UTC (History)
4 users (show)

See Also:
OS type for building Yocto: ---
Type of Regression: ---
Verified:
Documentation change: No (bug/feature does not impact docs)


Attachments

Note You need to log in before you can comment on or make changes to this bug.
Description Naveen Saini 2021-04-23 08:31:56 UTC
Failed on master:
Worker: fedora32-ty-1

https://autobuilder.yoctoproject.org/typhoon/#/builders/74/builds/3318

2021-04-23 04:07:25,228 - oe-selftest - INFO - meta_ide.MetaIDE.test_meta_ide_can_compile_c_program (subunit.RemotedTestCase)
2021-04-23 04:07:25,228 - oe-selftest - INFO -  ... ok
2021-04-23 04:07:25,229 - oe-selftest - INFO - 0: 2/3 3/4 (404.93s) (meta_ide.MetaIDE.test_meta_ide_can_compile_c_program)
2021-04-23 04:07:25,233 - oe-selftest - INFO - meta_ide.MetaIDE.test_meta_ide_had_installed_meta_ide_support (subunit.RemotedTestCase)
2021-04-23 04:07:25,233 - oe-selftest - INFO -  ... ok
2021-04-23 04:07:25,234 - oe-selftest - INFO - 0: 3/3 4/4 (0.01s) (meta_ide.MetaIDE.test_meta_ide_had_installed_meta_ide_support)
2021-04-23 04:07:26,435 - oe-selftest - INFO - ======================================================================
2021-04-23 04:07:26,435 - oe-selftest - INFO - FAIL: runqemu.QemuTest.test_qemu_can_shutdown (subunit.RemotedTestCase)
2021-04-23 04:07:26,435 - oe-selftest - INFO - ----------------------------------------------------------------------
2021-04-23 04:07:26,435 - oe-selftest - INFO - testtools.testresult.real._StringException: Traceback (most recent call last):
  File "/home/pokybuild/yocto-worker/qemumips64/build/meta/lib/oeqa/selftest/cases/runqemu.py", line 191, in test_qemu_can_shutdown
    self.assertTrue(qemu_shutdown_succeeded, 'Failed: %s does not shutdown within timeout(%s)' % (self.machine, shutdown_timeout))
  File "/usr/lib64/python3.8/unittest/case.py", line 765, in assertTrue
    raise self.failureException(msg)
AssertionError: False is not true : Failed: qemumips64 does not shutdown within timeout(120)
Comment 1 Naveen Saini 2021-04-23 08:33:20 UTC
Old bug, in Fixed statu:
https://bugzilla.yoctoproject.org/show_bug.cgi?id=13234
Comment 2 Randy MacLeod 2021-04-29 14:40:47 UTC
Similar to 14128 perhaps.
Comment 3 Randy MacLeod 2021-04-29 15:00:56 UTC
duplicate shutdown bug

*** This bug has been marked as a duplicate of bug 14128 ***
Comment 4 Randy MacLeod 2025-02-14 16:46:21 UTC
bulk change to add Saul's non-WR address.
Comment 5 Randy MacLeod 2025-02-14 16:48:10 UTC
Bulk change: Remove Saul's old WR address.