Bug 14401 - Test unable to login to serial console
Summary: Test unable to login to serial console
Status: RESOLVED FIXED
Alias: None
Product: OE-Core
Classification: Build System, Metadata & Runtime
Component: core (show other bugs)
Version: 3.3
Hardware: x86 Multiple
: Medium normal
Target Milestone: 5.99
Assignee: Unassigned
QA Contact:
URL:
Whiteboard: AB-INT
Depends on:
Blocks:
 
Reported: 2021-05-21 13:09 UTC by Jon Mason
Modified: 2026-08-27 14:44 UTC (History)
11 users (show)

See Also:
OS type for building Yocto: ---
Type of Regression: ---
Verified:
Documentation change: Don't know


Attachments

Note You need to log in before you can comment on or make changes to this bug.
Description Jon Mason 2021-05-21 13:09:10 UTC
From https://autobuilder.yoctoproject.org/typhoon/#/builders/63/builds/3392/steps/14/logs/stdio


On qemuppc

core-image-minimal () - Ran 66 tests in 14.676s
core-image-minimal - OK - All required tests passed (successes=1, skipped=65, failures=0, errors=0)
NOTE: recipe core-image-minimal-1.0-r0: task do_testimage: Succeeded
SDK testing environment: ppc7400-poky-linux
WARNING: core-image-sato-1.0-r0 do_testimage: Couldn't login into serial console as root using blank password
WARNING: core-image-sato-1.0-r0 do_testimage: The output:
root<<< run_serial(): command timed out after 120 seconds without output >>>


Seems to be intermittent, as no other occurrences.
Comment 1 Randy MacLeod 2021-05-27 14:36:56 UTC
Richard thinks that there are addional interrupt problems on qemuppc.
Comment 2 Alexandre Belloni 2021-06-16 00:56:50 UTC
https://autobuilder.yoctoproject.org/typhoon/#/builders/102/builds/1738/steps/13/logs/stdio

qemumips-alt
fedora31-ty-1
Comment 3 Alexandre Belloni 2021-06-16 01:00:46 UTC
https://autobuilder.yoctoproject.org/typhoon/#/builders/110/builds/2358/steps/12/logs/stdio

qemuarm-alt
ubuntu1804-ty-3
Comment 4 Alexandre Belloni 2021-06-20 17:29:55 UTC
https://autobuilder.yoctoproject.org/typhoon/#/builders/107/builds/1754/steps/13/logs/stdio

qemuppc-alt fedora31-ty-1
Comment 5 Alexandre Belloni 2021-06-24 12:04:41 UTC
https://autobuilder.yoctoproject.org/typhoon/#/builders/64/builds/3570/steps/12/logs/stdio

musl-qemux86 ubuntu1804-ty-3
Comment 6 Alexandre Belloni 2021-06-24 12:07:37 UTC
https://autobuilder.yoctoproject.org/typhoon/#/builders/56/builds/1487/steps/14/logs/stdio

oe-selftest ubuntu1804-ty-1
Comment 7 Alexandre Belloni 2021-08-10 16:16:47 UTC
https://autobuilder.yoctoproject.org/typhoon/#/builders/37/builds/3740/steps/12/logs/stdio

qemumips64 ubuntu1804-ty-3
Comment 8 Alexandre Belloni 2021-08-11 15:22:10 UTC
https://autobuilder.yoctoproject.org/typhoon/#/builders/63/builds/3770/steps/13/logs/stdio

qemuppc ubuntu1804-ty-2
Comment 9 Alexandre Belloni 2021-09-16 09:28:29 UTC
https://autobuilder.yoctoproject.org/typhoon/#/builders/87/builds/2483/steps/14/logs/stdio

oe-selftest-ubuntu ubuntu2004-ty-1
Comment 10 Alexandre Belloni 2021-09-16 14:49:01 UTC
Previous occurrence was due to a permission issue on the worker
Comment 11 Alexandre Belloni 2021-09-23 13:29:30 UTC
https://autobuilder.yoctoproject.org/typhoon/#/builders/53/builds/4034/steps/13/logs/stdio
qemuarm ubuntu1804-ty-1

rcu stall detected
Comment 12 Alexandre Belloni 2021-09-23 22:31:52 UTC
https://autobuilder.yoctoproject.org/typhoon/#/builders/63/builds/4010/steps/14/logs/stdio
qemuppc ubuntu1604-ty-1
Comment 13 Oleksiy Obitotskyy 2021-09-27 08:46:27 UTC
https://autobuilder.yoctoproject.org/typhoon/#/builders/102/builds/2139
qemumips-alt ubuntu1804-ty-3
Comment 14 Naveen Saini 2021-10-04 05:29:59 UTC
On master-next:

qemumips-alt debian9-ty-2
https://autobuilder.yoctoproject.org/typhoon/#/builders/102/builds/2169/steps/14/logs/stdio
Comment 21 Alexandre Belloni 2022-01-26 23:17:37 UTC
https://autobuilder.yoctoproject.org/typhoon/#/builders/102/builds/2596/steps/13/logs/stdio

qemumips-alt ubuntu1804-ty-3 non-SSD
Comment 22 Alexandre Belloni 2022-03-17 16:35:27 UTC
https://autobuilder.yoctoproject.org/typhoon/#/builders/107/builds/2760/steps/13/logs/stdio

qemuppc-alt ubuntu1804-ty-3 non-SSD
Comment 23 Leonardo Sandoval 2022-04-20 22:53:02 UTC
https://autobuilder.yoctoproject.org/typhoon/#/builders/63/builds/5043/steps/13/logs/stdio

│ ubuntu2004-ty-1  │ SSD     │
Comment 26 Alexandre Belloni 2022-06-16 13:49:20 UTC
https://autobuilder.yoctoproject.org/typhoon/#builders/107/builds/3117/steps/13/logs/stdio

qemuppc-alt ubuntu2004-ty-1
Comment 27 Alexandre Belloni 2022-11-10 13:33:14 UTC
https://autobuilder.yoctoproject.org/typhoon/#/builders/102/builds/3767/steps/12/logs/stdio

qemumips-alt ubuntu2004-ty-1
Comment 28 Alexandre Belloni 2022-11-22 22:55:21 UTC
https://autobuilder.yoctoproject.org/typhoon/#/builders/63/builds/6165/steps/13/logs/stdio

qemuppc opensuse154-ty-2
Comment 29 Alexandre Belloni 2022-12-22 16:16:28 UTC
https://autobuilder.yoctoproject.org/typhoon/#builders/107/builds/3962/steps/13/logs/stdio

qemuppc-alt alma8-ty-2
Comment 31 Alexandre Belloni 2023-02-16 23:09:25 UTC
https://autobuilder.yoctoproject.org/typhoon/#/builders/63/builds/6507/steps/19/logs/stdio
qemuppc ubuntu2004-ty-1
Comment 32 Alexandre Belloni 2023-03-09 15:19:45 UTC
https://autobuilder.yoctoproject.org/typhoon/#builders/63/builds/6722/steps/13/logs/stdio

qemuppc ubuntu2204-ty-3
Comment 33 Alexandre Belloni 2023-03-10 15:10:12 UTC
https://autobuilder.yoctoproject.org/typhoon/#/builders/63/builds/6743/steps/18/logs/stdio

qemuppc fedora37-ty-1
Comment 34 Luca Ceresoli 2023-04-13 07:11:58 UTC
https://autobuilder.yoctoproject.org/typhoon/#/builders/79/builds/5060/steps/14/logs/stdio

oe-selftest-centos on rocky9-ty-1

Waiting at most 1000 seconds for login banner (04/12/23 21:22:25)
Connection from 127.0.0.1:42218
Reached login banner in 7.85 seconds (04/12/23 21:22:33)
Couldn't login into serial console as root using blank password
The output:
<<< run_serial(): command timed out after 120 seconds without output >>>
2023-04-12 21:25:38,787 - oe-selftest - INFO - 5: 25/29 391/527 (313.61s) (0 failed) (overlayfs.OverlayFSEtcRunTimeTests.test_sbin_init_preinit)
2023-04-12 21:25:38,787 - oe-selftest - INFO - testtools.testresult.real._StringException: Traceback (most recent call last):
  File "/home/pokybuild/yocto-worker/oe-selftest-centos/build/meta/lib/oeqa/core/decorator/__init__.py", line 35, in wrapped_f
    return func(*args, **kwargs)
  File "/home/pokybuild/yocto-worker/oe-selftest-centos/build/meta/lib/oeqa/selftest/cases/overlayfs.py", line 370, in test_sbin_init_preinit
    self.run_sbin_init(False)
  File "/home/pokybuild/yocto-worker/oe-selftest-centos/build/meta/lib/oeqa/selftest/cases/overlayfs.py", line 419, in run_sbin_init
    self.assertTrue(line and line.startswith(testFile), msg=output)
  File "/usr/lib64/python3.9/unittest/case.py", line 688, in assertTrue
    raise self.failureException(msg)
AssertionError: None is not true :  run_serial(): command timed out after 60 seconds without output >>>
Comment 35 Alexandre Belloni 2023-07-18 17:56:25 UTC
https://autobuilder.yoctoproject.org/typhoon/#/builders/63/builds/7382/steps/13/logs/stdio

qemuppc fedora38-ty-1
Comment 36 Randy MacLeod 2023-10-30 15:37:28 UTC
Build move to 5.0 -- ../Randy
Comment 37 Alexandre Belloni 2023-12-11 22:15:12 UTC
https://autobuilder.yoctoproject.org/typhoon/#/builders/63/builds/8069/steps/13/logs/stdio

qemuppc ubuntu2304-ty-1
Comment 38 Alexandre Belloni 2023-12-11 22:47:26 UTC
https://autobuilder.yoctoproject.org/typhoon/#/builders/80/builds/5990/steps/14/logs/stdio

oe-selftest-debian debian12-ty-1
Comment 39 Randy MacLeod 2024-04-24 20:30:23 UTC
Bulk move from 5.0* to 5.99 to indicate that there isn't any one available to work on this issue.
Comment 40 Randy MacLeod 2024-05-02 14:52:09 UTC
Lots of changes in the serial console area and hasn't been seen in 5 months.
Comment 41 Alexandre Belloni 2024-05-08 20:28:19 UTC
https://autobuilder.yoctoproject.org/typhoon/#/builders/63/builds/8883/steps/14/logs/stdio

qemuppc fedora39-ty-2
Comment 44 Randy MacLeod 2025-02-13 15:40:26 UTC
There was lots of work and fixes in this area. 
Odd that it hasn't recurred but it isn't.
Comment 45 Mathieu Dubois-Briand 2025-02-25 12:47:26 UTC
qemuppc-tc alma9-vk-2 master completed at 2025-02-20T05:18:26Z
https://autobuilder.yoctoproject.org/valkyrie/#/builders/49/builds/1027/steps/12/logs/stdio

Looks more like https://bugzilla.yoctoproject.org/show_bug.cgi?id=14522 , but
that one was previously closed in favor of this one.
Comment 46 João Marcos Costa 2026-08-26 11:01:14 UTC
This happened again:

https://autobuilder.yoctoproject.org/valkyrie/#/builders/110/builds/932/steps/16/logs/warnings

qemux86-64-musl-ptest debian11-vk-3

I was not aware of this bug, so I filed another one to track this same failure with lttng-tools:

https://bugzilla.yoctoproject.org/show_bug.cgi?id=16358

So #16358 might be a duplicata of #14401.
Comment 47 Randy MacLeod 2026-08-27 14:44:11 UTC
Using the new defect link in 
https://bugzilla.yoctoproject.org/show_bug.cgi?id=14401#c46
track this problem.