Bug 1460 - [sstate]: numerous lib*-perl recipes fail due to sstate relocation issues
Summary: [sstate]: numerous lib*-perl recipes fail due to sstate relocation issues
Status: RESOLVED FIXED
Alias: None
Product: OE-Core
Classification: Build System, Metadata & Runtime
Component: devtools / tool chain (show other bugs)
Version: 1.0
Hardware: x86 Multiple
: High major
Target Milestone: 1.1
Assignee: Saul Wold
QA Contact:
URL:
Whiteboard:
Depends on:
Blocks:
 
Reported: 2011-09-06 08:58 UTC by Saul Wold
Modified: 2011-09-07 17:43 UTC (History)
3 users (show)

See Also:
OS type for building Yocto: ---
Type of Regression: ---
Verified:
Documentation change: ---


Attachments

Note You need to log in before you can comment on or make changes to this bug.
Description Saul Wold 2011-09-06 08:58:49 UTC
liburi-perl, libxml-sax-perl, libxml-namespacesupport-perl, linxml-parser-perl all fail in a similar fashion:

ERROR: Logfile of failure stored in: /srv/home/pokybuild/yocto-autobuilder/yocto-slave/nightly-mips/build/build/tmp/work/mips-poky-linux/liburi-perl-1.58-r1/temp/log.do_compile.13420
Log data follows:
| NOTE: make -j 16 -e MAKEFLAGS= PASTHRU_INC= -O2 -pipe -g -feliminate-unused-debug-types CCFLAGS= -O2 -pipe -g -feliminate-unused-debug-types LD=ccache mips-poky-linux-gcc  -meb -mabi=32   -mhard-float -march=mips32 --sysroot=/srv/home/pokybuild/yocto-autobuilder/yocto-slave/nightly-mips/build/build/tmp/sysroots/qemumips
| Can't locate ExtUtils/Command.pm in @INC (@INC contains: /srv/home/pokybuild/yocto-autobuilder/yocto-slave/nightly-x86/build/build/tmp/sysroots/x86_64-linux/usr/lib/perl-native/perl/5.12.3 /srv/home/pokybuild/yocto-autobuilder/yocto-slave/nightly-x86/build/build/tmp/sysroots/x86_64-linux/usr/lib/perl-native/perl/5.12.3 /srv/home/pokybuild/yocto-autobuilder/yocto-slave/nightly-x86/build/build/tmp/sysroots/x86_64-linux/usr/lib/perl-native/perl/5.12.3 .).
| BEGIN failed--compilation aborted.
| Can't locate ExtUtils/Command.pm in @INC (@INC contains: /srv/home/pokybuild/yocto-autobuilder/yocto-slave/nightly-x86/build/build/tmp/sysroots/x86_64-linux/usr/lib/perl-native/perl/5.12.3 /srv/home/pokybuild/yocto-autobuilder/yocto-slave/nightly-x86/build/build/tmp/sysroots/x86_64-linux/usr/lib/perl-native/perl/5.12.3 /srv/home/pokybuild/yocto-autobuilder/yocto-slave/nightly-x86/build/build/tmp/sysroots/x86_64-linux/usr/lib/perl-native/perl/5.12.3 .).
| BEGIN failed--compilation aborted.
| Can't locate ExtUtils/Command.pm in @INC (@INC contains: /srv/home/pokybuild/yocto-autobuilder/yocto-slave/nightly-x86/build/build/tmp/sysroots/x86_64-linux/usr/lib/perl-native/perl/5.12.3 /srv/home/pokybuild/yocto-autobuilder/yocto-slave/nightly-x86/build/build/tmp/sysroots/x86_64-linux/usr/lib/perl-native/perl/5.12.3 /srv/home/pokybuild/yocto-autobuilder/yocto-slave/nightly-x86/build/build/tmp/sysroots/x86_64-linux/usr/lib/perl-native/perl/5.12.3 .).
| BEGIN failed--compilation aborted.
| Can't locate ExtUtils/Command.pm in @INC (@INC contains: /srv/home/pokybuild/yocto-autobuilder/yocto-slave/nightly-x86/build/build/tmp/sysroots/x86_64-linux/usr/lib/perl-native/perl/5.12.3 /srv/home/pokybuild/yocto-autobuilder/yocto-slave/nightly-x86/build/build/tmp/sysroots/x86_64-linux/usr/lib/perl-native/perl/5.12.3 /srv/home/pokybuild/yocto-autobuilder/yocto-slave/nightly-x86/build/build/tmp/sysroots/x86_64-linux/usr/lib/perl-native/perl/5.12.3 .).
| BEGIN failed--compilation aborted.
| Can't locate ExtUtils/Command.pm in @INC (@INC contains: /srv/home/pokybuild/yocto-autobuilder/yocto-slave/nightly-x86/build/build/tmp/sysroots/x86_64-linux/usr/lib/perl-native/perl/5.12.3 /srv/home/pokybuild/yocto-autobuilder/yocto-slave/nightly-x86/build/build/tmp/sysroots/x86_64-linux/usr/lib/perl-native/perl/5.12.3 /srv/home/pokybuild/yocto-autobuilder/yocto-slave/nightly-x86/build/build/tmp/sysroots/x86_64-linux/usr/lib/perl-native/perl/5.12.3 .).
| BEGIN failed--compilation aborted.
| Can't locate ExtUtils/Command.pm in @INC (@INC contains: /srv/home/pokybuild/yocto-autobuilder/yocto-slave/nightly-x86/build/build/tmp/sysroots/x86_64-linux/usr/lib/perl-native/perl/5.12.3 /srv/home/pokybuild/yocto-autobuilder/yocto-slave/nightly-x86/build/build/tmp/sysroots/x86_64-linux/usr/lib/perl-native/perl/5.12.3 /srv/home/pokybuild/yocto-autobuilder/yocto-slave/nightly-x86/build/build/tmp/sysroots/x86_64-linux/usr/lib/perl-native/perl/5.12.3 .).
| BEGIN failed--compilation aborted.
| Can't locate ExtUtils/Command.pm in @INC (@INC contains: /srv/home/pokybuild/yocto-autobuilder/yocto-slave/nightly-x86/build/build/tmp/sysroots/x86_64-linux/usr/lib/perl-native/perl/5.12.3 /srv/home/pokybuild/yocto-autobuilder/yocto-slave/nightly-x86/build/build/tmp/sysroots/x86_64-linux/usr/lib/perl-native/perl/5.12.3 /srv/home/pokybuild/yocto-autobuilder/yocto-slave/nightly-x86/build/build/tmp/sysroots/x86_64-linux/usr/lib/perl-native/perl/5.12.3 .).
| BEGIN failed--compilation aborted.
| Can't locate ExtUtils/Command.pm in @INC (@INC contains: /srv/home/pokybuild/yocto-autobuilder/yocto-slave/nightly-x86/build/build/tmp/sysroots/x86_64-linux/usr/lib/perl-native/perl/5.12.3 /srv/home/pokybuild/yocto-autobuilder/yocto-slave/nightly-x86/build/build/tmp/sysroots/x86_64-linux/usr/lib/perl-native/perl/5.12.3 /srv/homeERROR: Function 'do_compile' failed (see /srv/home/pokybuild/yocto-autobuilder/yocto-slave/nightly-mips/build/build/tmp/work/mips-poky-linux/liburi-perl-1.58-r1/temp/log.do_compile.13420 for further information)
| /pokybuild/yocto-autobuilder/yocto-slave/nightly-x86/build/build/tmp/sysroots/x86_64-linux/usr/lib/perl-native/perl/5.12.3 .).
| BEGIN failed--compilation aborted.
| make: *** [blib/lib/.exists] Error 2
| make: *** Waiting for unfinished jobs....
| make: *** [blib/arch/.exists] Error 2
| make: *** [blib/lib/auto/URI/.exists] Error 2
| make: *** [blib/arch/auto/URI/.exists] Error 2
| make: *** [blib/bin/.exists] Error 2
| make: *** [blib/script/.exists] Error 2
| make: *** [blib/man1/.exists] Error 2
| make: *** [blib/man3/.exists] Error 2
| ERROR: oe_runmake failed
NOTE: package liburi-perl-1.58-r1: task do_compile: Failed
ERROR: Task 2687 (/srv/home/pokybuild/yocto-autobuilder/yocto-slave/nightly-mips/build/meta/recipes-devtools/perl/liburi-perl_1.58.bb, do_compile) failed with exit code '1'