2022-09-18 01:15:50,817 - oe-selftest - INFO - buildoptions.ImageOptionsTests.test_ccache_tool (subunit.RemotedTestCase) 2022-09-18 01:15:50,817 - oe-selftest - INFO - ... FAIL 2022-09-18 01:15:50,817 - oe-selftest - INFO - 7: 1/11 143/503 (483.42s) (buildoptions.ImageOptionsTests.test_ccache_tool) 2022-09-18 01:15:50,818 - oe-selftest - INFO - testtools.testresult.real._StringException: Traceback (most recent call last): File "/home/pokybuild/yocto-worker/oe-selftest-centos/build/meta/lib/oeqa/selftest/cases/buildoptions.py", line 46, in test_ccache_tool bitbake("%s -f -c compile" % recipe) File "/home/pokybuild/yocto-worker/oe-selftest-centos/build/meta/lib/oeqa/utils/commands.py", line 236, in bitbake return runCmd(cmd, ignore_status, timeout, output_log=output_log, **options) File "/home/pokybuild/yocto-worker/oe-selftest-centos/build/meta/lib/oeqa/utils/commands.py", line 214, in runCmd raise AssertionError("Command '%s' returned non-zero exit status %d:\n%s" % (command, result.status, exc_output)) AssertionError: Command 'bitbake libgcc-initial -f -c compile' returned non-zero exit status 1: /usr/lib64/python3.6/importlib/_bootstrap.py:219: ImportWarning: can't resolve package from __spec__ or __package__, falling back on __name__ and __path__ return f(*args, **kwds) | abort()ing pseudo client by server request. See https://wiki.yoctoproject.org/wiki/Pseudo_Abort for more details on this. | Check logfile: /home/pokybuild/yocto-worker/oe-selftest-centos/build/build-st-390979/tmp/work/core2-64-poky-linux/linux-libc-headers/5.19-r0/pseudo//pseudo.log | /bin/sh: line 1: 657872 Aborted (core dumped) mkdir -p /home/pokybuild/yocto-worker/oe-selftest-centos/build/build-st-390979/tmp/work/core2-64-poky-linux/linux-libc-headers/5.19-r0/image/usr | make: *** [Makefile:1277: headers_install] Error 134 | ERROR: oe_runmake failed | WARNING: /home/pokybuild/yocto-worker/oe-selftest-centos/build/build-st-390979/tmp/work/core2-64-poky-linux/linux-libc-headers/5.19-r0/temp/run.do_install.645110:185 exit 1 from 'exit 1' | WARNING: Backtrace (BB generated script): | #1: bbfatal_log, /home/pokybuild/yocto-worker/oe-selftest-centos/build/build-st-390979/tmp/work/core2-64-poky-linux/linux-libc-headers/5.19-r0/temp/run.do_install.645110, line 185 | #2: die, /home/pokybuild/yocto-worker/oe-selftest-centos/build/build-st-390979/tmp/work/core2-64-poky-linux/linux-libc-headers/5.19-r0/temp/run.do_install.645110, line 169 | #3: oe_runmake, /home/pokybuild/yocto-worker/oe-selftest-centos/build/build-st-390979/tmp/work/core2-64-poky-linux/linux-libc-headers/5.19-r0/temp/run.do_install.645110, line 164 | #4: do_install, /home/pokybuild/yocto-worker/oe-selftest-centos/build/build-st-390979/tmp/work/core2-64-poky-linux/linux-libc-headers/5.19-r0/temp/run.do_install.645110, line 154 | #5: main, /home/pokybuild/yocto-worker/oe-selftest-centos/build/build-st-390979/tmp/work/core2-64-poky-linux/linux-libc-headers/5.19-r0/temp/run.do_install.645110, line 198 NOTE: recipe linux-libc-headers-5.19-r0: task do_install: Failed ERROR: Task (/home/pokybuild/yocto-worker/oe-selftest-centos/build/meta/recipes-kernel/linux-libc-headers/linux-libc-headers_5.19.bb:do_install) failed with exit code '1' Pseudo log: path mismatch [2 links]: ino 20987078 db 'NAMELESS FILE' req '/home/pokybuild/yocto-worker/oe-selftest-centos/build/build-st-390979/tmp/work/core2-64-poky-linux/linux-libc-headers/5.19-r0/image/usr'. Setup complete, sending SIGUSR1 to pid 645111.
https://autobuilder.yoctoproject.org/typhoon/#/builders/79/builds/4263/steps/15/logs/stdio oe-selftest-centos alma8-ty-1
https://autobuilder.yoctoproject.org/typhoon/#/builders/79/builds/4263/steps/15/logs/stdio oe-selftest-debian on debian11-ty-3
Created attachment 4917 [details] pseudo.log for oe-selftest-debian build failure 4263
https://git.yoctoproject.org/poky/commit/?id=45c7a5e2ac700f88b24aeb0d8e69a8f8b148d073