Bug 15005 - ParseError in None: Not all recipes parsed, parser thread killed/died? Exiting.
Summary: ParseError in None: Not all recipes parsed, parser thread killed/died? Exiting.
Status: RESOLVED FIXED
Alias: None
Product: BitBake
Classification: Build System, Metadata & Runtime
Component: bitbake (show other bugs)
Version: unspecified
Hardware: x86 Multiple
: Medium+ normal
Target Milestone: 5.0 M1
Assignee: Richard Purdie
QA Contact:
URL:
Whiteboard: AB-INT
: 14665 (view as bug list)
Depends on:
Blocks:
 
Reported: 2023-01-12 15:35 UTC by Alexandre Belloni
Modified: 2024-12-24 23:34 UTC (History)
9 users (show)

See Also:
OS type for building Yocto: ---
Type of Regression: ---
Verified:
Documentation change: No (bug/feature does not impact docs)


Attachments

Note You need to log in before you can comment on or make changes to this bug.
Description Alexandre Belloni 2023-01-12 15:35:10 UTC
2022-12-29 14:15:47,695 - oe-selftest - INFO - FAIL: sysroot.SysrootTests.test_sysroot_cleanup (subunit.RemotedTestCase)
2022-12-29 14:15:47,695 - oe-selftest - INFO - ----------------------------------------------------------------------
2022-12-29 14:15:47,695 - oe-selftest - INFO - testtools.testresult.real._StringException: Traceback (most recent call last):
  File "/home/pokybuild/yocto-worker/oe-selftest-debian/build/meta/lib/oeqa/selftest/cases/sysroot.py", line 32, in test_sysroot_cleanup
    bitbake("sysroot-test")
  File "/home/pokybuild/yocto-worker/oe-selftest-debian/build/meta/lib/oeqa/utils/commands.py", line 236, in bitbake
    return runCmd(cmd, ignore_status, timeout, output_log=output_log, **options)
  File "/home/pokybuild/yocto-worker/oe-selftest-debian/build/meta/lib/oeqa/utils/commands.py", line 214, in runCmd
    raise AssertionError("Command '%s' returned non-zero exit status %d:\n%s" % (command, result.status, exc_output))
AssertionError: Command 'bitbake  sysroot-test' returned non-zero exit status 1:
NOTE: Reconnecting to bitbake server...
Loading cache...done.
Loaded 0 entries from dependency cache.
Parsing recipes...ERROR: ParseError in None: Not all recipes parsed, parser thread killed/died? Exiting.
ERROR: Parsing halted due to errors, see error messages above
Comment 1 Alexandre Belloni 2023-01-12 15:35:40 UTC
https://autobuilder.yoctoproject.org/typhoon/#builders/80/builds/4545/steps/14/logs/stdio
oe-selftest-debian debian11-ty-2
Comment 2 Randy MacLeod 2023-01-12 15:44:25 UTC
May have been fixed by patch on Jan 11.
Comment 4 Alexandre Belloni 2023-02-03 21:50:32 UTC
https://autobuilder.yoctoproject.org/typhoon/#/builders/87/builds/4767/steps/14/logs/stdio

2023-01-29 21:33:23,461 - oe-selftest - INFO - prservice.BitbakePrTests.test_import_export_override_db (subunit.RemotedTestCase)
2023-01-29 21:33:23,462 - oe-selftest - INFO -  ... FAIL
2023-01-29 21:33:23,462 - oe-selftest - INFO - 10: 11/23 232/510 (4667.61s) (0 failed) (prservice.BitbakePrTests.test_import_export_override_db)
2023-01-29 21:33:23,462 - oe-selftest - INFO - testtools.testresult.real._StringException: Traceback (most recent call last):
  File "/home/pokybuild/yocto-worker/oe-selftest-ubuntu/build/meta/lib/oeqa/selftest/cases/prservice.py", line 100, in test_import_export_override_db
    self.run_test_pr_export_import('m4', replace_current_db=False)
  File "/home/pokybuild/yocto-worker/oe-selftest-ubuntu/build/meta/lib/oeqa/selftest/cases/prservice.py", line 89, in run_test_pr_export_import
    self.assertEqual(import_result.status, 0, msg="PR Service database import failed: %s" % import_result.output)
  File "/usr/lib/python3.8/unittest/case.py", line 912, in assertEqual
    assertion_func(first, second, msg=msg)
  File "/usr/lib/python3.8/unittest/case.py", line 905, in _baseAssertEqual
    raise self.failureException(msg)
AssertionError: 1 != 0 : PR Service database import failed: NOTE: Terminated bitbake server.
NOTE: Started PRServer with DBfile: /home/pokybuild/yocto-worker/oe-selftest-ubuntu/build/build-st-1389717/cache/prserv.sqlite3, Address: 127.0.0.1:36735, PID: 893940
Loading cache...done.
Loaded 0 entries from dependency cache.
Parsing recipes...ERROR: ParseError in None: Not all recipes parsed, parser thread killed/died? Exiting.
ERROR: Parsing halted due to errors, see error messages above
Comment 5 Richard Purdie 2023-02-05 14:43:46 UTC
This occurred again, ubuntu2004-ty-1 again:

https://autobuilder.yoctoproject.org/typhoon/#/builders/87/builds/4796/steps/14/logs/stdio

in prserver tests. What was interesting is I could see the bitbake-cookerdaemon.log for this one which has:

$ cat bitbake-cookerdaemon.log | grep ld.so -C 10
2770009 01:12:30.225787 Running command ['getVariable', 'BB_DEFAULT_TASK']
2770009 01:12:30.226056 Command Completed (socket: True)
2770009 01:12:30.226183 Running command ['setConfig', 'cmd', 'build']
2770009 01:12:30.226422 Command Completed (socket: True)
2770009 01:12:30.226540 Running command ['getVariable', 'BBTARGETS']
2770009 01:12:30.226782 Command Completed (socket: True)
2770009 01:12:30.226922 Running command ['parseFiles']
2770009 01:12:30.227045 Registering idle function <bound method Command.runAsyncCommand of <bb.command.Command object at 0x7fd33ad6b970>> (1 handlers)
2770009 01:12:30.227133 Command Completed (socket: True)
2770009 01:12:30.354229 Parsing started
Inconsistency detected by ld.so: dl-open.c: 560: dl_open_worker: Assertion `_dl_debug_initialize (0, args->nsid)->r_state == RT_CONSISTENT' failed!
/usr/lib/python3.8/asyncio/base_events.py:654: ResourceWarning: unclosed event loop <_UnixSelectorEventLoop running=False closed=False debug=False>
  _warn(f"unclosed event loop {self!r}", ResourceWarning, source=self)
ResourceWarning: Enable tracemalloc to get the object allocation traceback
/usr/lib/python3.8/asyncio/selector_events.py:696: ResourceWarning: unclosed transport <_SelectorSocketTransport fd=15>
  _warn(f"unclosed transport {self!r}", ResourceWarning, source=self)
ResourceWarning: Enable tracemalloc to get the object allocation traceback
/usr/lib/python3.8/asyncio/base_events.py:654: ResourceWarning: unclosed event loop <_UnixSelectorEventLoop running=False closed=False debug=False>
  _warn(f"unclosed event loop {self!r}", ResourceWarning, source=self)
ResourceWarning: Enable tracemalloc to get the object allocation traceback
/usr/lib/python3.8/asyncio/selector_events.py:696: ResourceWarning: unclosed transport <_SelectorSocketTransport fd=15>
pokybuild@ubuntu2004-ty-1:~/saved/build/build-st-1417193$ cat bitbake-cookerdaemon.log | grep ld.so -C 30
2770009 01:12:29.284563 Accepting [<socket.socket fd=6, family=AddressFamily.AF_UNIX, type=SocketKind.SOCK_STREAM, proto=0, laddr=bitbake.sock>] ([])
2770009 01:12:29.284653 Processing Client
2770009 01:12:29.284708 Connecting Client
2770009 01:12:29.285151 Running command ['setFeatures', [2, 1]]
2770009 01:12:29.285902 Command Completed (socket: True)
2770009 01:12:29.286055 Running command ['updateConfig', {'halt': True, 'force': False, 'invalidate_stamp': None, 'dry_run': False, 'dump_signatures': [], 'extra_assume_provided': [], 'profile': False, 'prefile': [], 'postfile': ['conf/primport.conf', '/home/pokybuild/yocto-worker/oe-selftest-ubuntu/build/build-st-1417193/export.inc'], 'server_timeout': None, 'nosetscene': False, 'setsceneonly': False, 'skipsetscene': False, 'runall': [], 'runonly': None, 'writeeventlog': None, 'build_verbose_shell': False, 'build_verbose_stdout': False, 'default_loglevel': 20, 'debug_domains': {}}, {'SHELL': '/bin/bash', 'BB_ENV_PASSTHROUGH_ADDITIONS': 'ALL_PROXY BBPATH_EXTRA BB_LOGCONFIG BB_NO_NETWORK BB_NUMBER_THREADS BB_SETSCENE_ENFORCE BB_SRCREV_POLICY DISTRO FTPS_PROXY FTP_PROXY GIT_PROXY_COMMAND HTTPS_PROXY HTTP_PROXY MACHINE NO_PROXY PARALLEL_MAKE SCREENDIR SDKMACHINE SOCKS5_PASSWD SOCKS5_USER SSH_AGENT_PID SSH_AUTH_SOCK STAMPS_DIR TCLIBC TCMODE all_proxy ftp_proxy ftps_proxy http_proxy https_proxy no_proxy ', 'BB_LOGCONFIG': '/home/pokybuild/yocto-worker/oe-selftest-ubuntu/build/build-st-1417193/../bitbake/contrib/autobuilderlog.json', 'PWD': '/home/pokybuild/yocto-worker/oe-selftest-ubuntu/build/build-st-1417193', 'LOGNAME': 'pokybuild', 'HOME': '/home/pokybuild', 'BBPATH': '/home/pokybuild/yocto-worker/oe-selftest-ubuntu/build/build-st-1417193', 'USER': 'pokybuild', 'PATH': '/home/pokybuild/yocto-worker/oe-selftest-ubuntu/build/scripts:/home/pokybuild/yocto-worker/oe-selftest-ubuntu/build/bitbake/bin:/usr/local/sbin:/usr/local/bin:/usr/sbin:/usr/bin:/sbin:/bin:/snap/bin', 'LC_ALL': 'en_US.UTF-8', 'ABHELPER_JSON': 'config.json /home/pokybuild/config-local.json', 'LANG': 'en_US.UTF-8', 'INVOCATION_ID': '8f2cbc607c9141729fa2996fd6abc6f3', 'OEQA_DEBUGGING_SAVED_OUTPUT': '/srv/autobuilder/autobuilder.yocto.io/pub/repro-fail/', 'PYTHONPATH': '/home/pokybuild/yocto-worker/oe-selftest-ubuntu/build/bitbake/lib:', 'SCRIPTSDIR': '/home/pokybuild/yocto-worker/oe-selftest-ubuntu/yocto-autobuilder-helper/scripts', 'DISPLAY': ':1', 'SHLVL': '1', 'JOURNAL_STREAM': '9:32262', 'BUILDDIR': '/home/pokybuild/yocto-worker/oe-selftest-ubuntu/build/build-st-1417193', 'OLDPWD': '/home/pokybuild/yocto-worker/oe-selftest-ubuntu/build', '_': '/home/pokybuild/yocto-worker/oe-selftest-ubuntu/build/bitbake/bin/bitbake'}, ['/home/pokybuild/yocto-worker/oe-selftest-ubuntu/build/bitbake/bin/bitbake', '-R', 'conf/primport.conf', '-R', '/home/pokybuild/yocto-worker/oe-selftest-ubuntu/build/build-st-1417193/export.inc', '-p']]
Marking as dirty due to 'postfile' option change to '['conf/primport.conf', '/home/pokybuild/yocto-worker/oe-selftest-ubuntu/build/build-st-1417193/export.inc']'
2770009 01:12:30.216211 Command Completed (socket: True)
2770009 01:12:30.216516 Running command ['getVariable', 'BBINCLUDELOGS']
2770009 01:12:30.217174 Command Completed (socket: True)
2770009 01:12:30.219200 Running command ['getVariable', 'BBINCLUDELOGS_LINES']
2770009 01:12:30.219621 Command Completed (socket: True)
2770009 01:12:30.219829 Running command ['getSetVariable', 'BB_CONSOLELOG']
2770009 01:12:30.220313 Command Completed (socket: True)
2770009 01:12:30.220442 Running command ['getSetVariable', 'BB_LOGCONFIG']
2770009 01:12:30.220725 Command Completed (socket: True)
2770009 01:12:30.224693 Running command ['getUIHandlerNum']
2770009 01:12:30.225155 Command Completed (socket: True)
2770009 01:12:30.225368 Running command ['setEventMask', 1, 20, {'BitBake.SigGen.HashEquiv': 19, 'BitBake.RunQueue.HashEquiv': 19}, ['bb.runqueue.runQueueExitWait', 'bb.event.LogExecTTY', 'logging.LogRecord', 'bb.build.TaskFailed', 'bb.build.TaskBase', 'bb.event.ParseStarted', 'bb.event.ParseProgress', 'bb.event.ParseCompleted', 'bb.event.CacheLoadStarted', 'bb.event.CacheLoadProgress', 'bb.event.CacheLoadCompleted', 'bb.command.CommandFailed', 'bb.command.CommandExit', 'bb.command.CommandCompleted', 'bb.cooker.CookerExit', 'bb.event.MultipleProviders', 'bb.event.NoProvider', 'bb.runqueue.sceneQueueTaskStarted', 'bb.runqueue.runQueueTaskStarted', 'bb.runqueue.runQueueTaskFailed', 'bb.runqueue.sceneQueueTaskFailed', 'bb.event.BuildBase', 'bb.build.TaskStarted', 'bb.build.TaskSucceeded', 'bb.build.TaskFailedSilent', 'bb.build.TaskProgress', 'bb.event.ProcessStarted', 'bb.event.ProcessProgress', 'bb.event.ProcessFinished']]
2770009 01:12:30.225654 Command Completed (socket: True)
2770009 01:12:30.225787 Running command ['getVariable', 'BB_DEFAULT_TASK']
2770009 01:12:30.226056 Command Completed (socket: True)
2770009 01:12:30.226183 Running command ['setConfig', 'cmd', 'build']
2770009 01:12:30.226422 Command Completed (socket: True)
2770009 01:12:30.226540 Running command ['getVariable', 'BBTARGETS']
2770009 01:12:30.226782 Command Completed (socket: True)
2770009 01:12:30.226922 Running command ['parseFiles']
2770009 01:12:30.227045 Registering idle function <bound method Command.runAsyncCommand of <bb.command.Command object at 0x7fd33ad6b970>> (1 handlers)
2770009 01:12:30.227133 Command Completed (socket: True)
2770009 01:12:30.354229 Parsing started
Inconsistency detected by ld.so: dl-open.c: 560: dl_open_worker: Assertion `_dl_debug_initialize (0, args->nsid)->r_state == RT_CONSISTENT' failed!
/usr/lib/python3.8/asyncio/base_events.py:654: ResourceWarning: unclosed event loop <_UnixSelectorEventLoop running=False closed=False debug=False>
  _warn(f"unclosed event loop {self!r}", ResourceWarning, source=self)
ResourceWarning: Enable tracemalloc to get the object allocation traceback
/usr/lib/python3.8/asyncio/selector_events.py:696: ResourceWarning: unclosed transport <_SelectorSocketTransport fd=15>
  _warn(f"unclosed transport {self!r}", ResourceWarning, source=self)
ResourceWarning: Enable tracemalloc to get the object allocation traceback
/usr/lib/python3.8/asyncio/base_events.py:654: ResourceWarning: unclosed event loop <_UnixSelectorEventLoop running=False closed=False debug=False>
  _warn(f"unclosed event loop {self!r}", ResourceWarning, source=self)
ResourceWarning: Enable tracemalloc to get the object allocation traceback
/usr/lib/python3.8/asyncio/selector_events.py:696: ResourceWarning: unclosed transport <_SelectorSocketTransport fd=15>
  _warn(f"unclosed transport {self!r}", ResourceWarning, source=self)
ResourceWarning: Enable tracemalloc to get the object allocation traceback
/usr/lib/python3.8/asyncio/base_events.py:654: ResourceWarning: unclosed event loop <_UnixSelectorEventLoop running=False closed=False debug=False>
  _warn(f"unclosed event loop {self!r}", ResourceWarning, source=self)
ResourceWarning: Enable tracemalloc to get the object allocation traceback
/usr/lib/python3.8/asyncio/selector_events.py:696: ResourceWarning: unclosed transport <_SelectorSocketTransport fd=15>
  _warn(f"unclosed transport {self!r}", ResourceWarning, source=self)
ResourceWarning: Enable tracemalloc to get the object allocation traceback
/usr/lib/python3.8/asyncio/base_events.py:654: ResourceWarning: unclosed event loop <_UnixSelectorEventLoop running=False closed=False debug=False>
  _warn(f"unclosed event loop {self!r}", ResourceWarning, source=self)
ResourceWarning: Enable tracemalloc to get the object allocation traceback
/usr/lib/python3.8/asyncio/selector_events.py:696: ResourceWarning: unclosed transport <_SelectorSocketTransport fd=15>
  _warn(f"unclosed transport {self!r}", ResourceWarning, source=self)
ResourceWarning: Enable tracemalloc to get the object allocation traceback
/usr/lib/python3.8/asyncio/base_events.py:654: ResourceWarning: unclosed event loop <_UnixSelectorEventLoop running=False closed=False debug=False>
  _warn(f"unclosed event loop {self!r}", ResourceWarning, source=self)
ResourceWarning: Enable tracemalloc to get the object allocation traceback
/usr/lib/python3.8/asyncio/selector_events.py:696: ResourceWarning: unclosed transport <_SelectorSocketTransport fd=15>
  _warn(f"unclosed transport {self!r}", ResourceWarning, source=self)
ResourceWarning: Enable tracemalloc to get the object allocation traceback


i.e.

Inconsistency detected by ld.so: dl-open.c: 560: dl_open_worker: Assertion `_dl_debug_initialize (0, args->nsid)->r_state == RT_CONSISTENT' failed!
Comment 6 Richard Purdie 2023-02-06 08:50:16 UTC
and again on ubuntu2004-arm-1:

https://autobuilder.yoctoproject.org/typhoon/#/builders/127/builds/914

which also had the ld.so message in bitbake-cookerdaemon.log:

Inconsistency detected by ld.so: dl-open.c: 560: dl_open_worker: Assertion `_dl_debug_initialize (0, args->nsid)->r_state == RT_CONSISTENT' failed!
Comment 7 Richard Purdie 2023-02-06 11:03:26 UTC
https://sourceware.org/bugzilla/show_bug.cgi?id=22380 kind of related?
Comment 9 Luca Ceresoli 2023-02-08 08:56:40 UTC
https://autobuilder.yoctoproject.org/typhoon/#/builders/127/builds/925/steps/14/logs/stdio

oe-selftest-armhost on ubuntu2004-arm-1
Comment 10 Luca Ceresoli 2023-02-10 21:11:23 UTC
https://autobuilder.yoctoproject.org/typhoon/#/builders/80/builds/4740/steps/14/logs/stdio

oe-selftest-debian on debian11-ty-2
Comment 11 Alexandre Belloni 2023-03-16 21:36:06 UTC
https://autobuilder.yoctoproject.org/typhoon/#/builders/127/builds/1118/steps/14/logs/stdio

oe-selftest-armhost ubuntu2004-arm-1
Comment 12 Alexandre Belloni 2023-03-23 15:27:51 UTC
https://autobuilder.yoctoproject.org/typhoon/#/builders/127/builds/1127/steps/14/logs/stdio

oe-selftest-armhost ubuntu2004-arm-1
Comment 15 Alexandre Belloni 2023-03-30 14:17:35 UTC
https://autobuilder.yoctoproject.org/typhoon/#/builders/87/builds/5028/steps/14/logs/stdio

oe-selftest-ubuntu ubuntu2004-ty-1
Comment 16 Joshua Watt 2023-03-30 15:10:57 UTC
This might be related to calling dlopen() calls from python inside forked processes. Potentially, something like python thinking there are threads inside the forked process and trying to clean them up, e.g. looking for pthread_cancel() in libgcc

It seems possible this is a race between when threads are created, and when processes are forked off. One way to try an track it down would be to track when threads are created in bitbake, and then log which threads are running when processes are forked off of bitbake to try and see any patterns.
Comment 17 Steve Sakoman 2023-04-02 16:39:56 UTC
Kirkstone occurrence:

https://autobuilder.yoctoproject.org/typhoon/#/builders/127/builds/1214/steps/14/logs/stdio

oe-selftest-armhost ubuntu2004-arm-1
Comment 18 Alexandre Belloni 2023-04-06 13:14:39 UTC
https://autobuilder.yoctoproject.org/typhoon/#/builders/127/builds/1211/steps/14/logs/stdio

oe-selftest-armhost ubuntu2004-arm-1
Comment 19 Alexandre Belloni 2023-05-18 19:47:53 UTC
https://autobuilder.yoctoproject.org/typhoon/#/builders/127/builds/1428/steps/14/logs/stdio

oe-selftest-armhost ubuntu2004-arm-1
Comment 20 Alexandre Belloni 2023-05-18 20:52:27 UTC
https://autobuilder.yoctoproject.org/typhoon/#/builders/127/builds/1355/steps/14/logs/stdio

oe-selftest-armhost ubuntu2004-arm-1
Comment 21 Alexandre Belloni 2023-06-09 17:58:48 UTC
https://autobuilder.yoctoproject.org/typhoon/#/builders/80/builds/5202/steps/14/logs/stdio

oe-selftest-debian debian11-ty-2
Comment 22 Luca Ceresoli 2023-06-22 12:33:03 UTC
https://autobuilder.yoctoproject.org/typhoon/#/builders/87/builds/5408/steps/14/logs/stdio

oe-selftest-ubuntu on ubuntu2004-ty-1
Comment 23 Alexandre Belloni 2023-07-18 15:20:43 UTC
https://autobuilder.yoctoproject.org/typhoon/#/builders/127/builds/1510/steps/14/logs/stdio

oe-selftest-armhost ubuntu2004-arm-1
Comment 24 Alexandre Belloni 2023-07-18 16:00:27 UTC
https://autobuilder.yoctoproject.org/typhoon/#/builders/127/builds/1678/steps/14/logs/stdio

oe-selftest-armhost ubuntu2004-arm-1
Comment 25 Alexandre Belloni 2023-07-18 16:29:58 UTC
https://autobuilder.yoctoproject.org/typhoon/#/builders/80/builds/5418/steps/14/logs/stdio

oe-selftest-debian debian11-ty-1
Comment 26 Alexandre Belloni 2023-07-19 14:32:56 UTC
https://autobuilder.yoctoproject.org/typhoon/#/builders/127/builds/1649/steps/14/logs/stdio

oe-selftest-armhost ubuntu2004-arm-1
Comment 27 Alexandre Belloni 2023-07-19 17:12:02 UTC
https://autobuilder.yoctoproject.org/typhoon/#/builders/87/builds/5398/steps/14/logs/stdio

oe-selftest-ubuntu ubuntu2004-ty-1
Comment 28 Alexandre Belloni 2023-07-20 17:22:29 UTC
https://autobuilder.yoctoproject.org/typhoon/#/builders/80/builds/5451/steps/14/logs/stdio

oe-selftest-debian debian11-ty-1
Comment 29 Alexandre Belloni 2023-07-20 17:44:47 UTC
https://autobuilder.yoctoproject.org/typhoon/#/builders/127/builds/1590/steps/14/logs/stdio

oe-selftest-armhost ubuntu2004-arm-1
Comment 30 Alexandre Belloni 2023-07-20 17:59:10 UTC
https://autobuilder.yoctoproject.org/typhoon/#/builders/127/builds/1604/steps/14/logs/stdio

oe-selftest-armhost ubuntu2004-arm-1
Comment 31 Alexandre Belloni 2023-07-20 18:07:48 UTC
https://autobuilder.yoctoproject.org/typhoon/#/builders/127/builds/1600/steps/14/logs/stdio

oe-selftest-armhost ubuntu2004-arm-1
Comment 32 Alexandre Belloni 2023-07-20 22:26:41 UTC
https://autobuilder.yoctoproject.org/typhoon/#/builders/80/builds/5298/steps/14/logs/stdio

oe-selftest-debian debian11-ty-1
Comment 33 Steve Sakoman 2023-07-26 14:42:09 UTC
Two mickledore failures on same a-full run:

https://autobuilder.yoctoproject.org/typhoon/#/builders/79/builds/5521

oe-selftest-centos alma9-ty-1


https://autobuilder.yoctoproject.org/typhoon/#/builders/86/builds/5512

oe-selftest-fedora fedora38-ty-4
Comment 34 Alexandre Belloni 2023-07-31 20:37:27 UTC
https://autobuilder.yoctoproject.org/typhoon/#/builders/87/builds/5535/steps/14/logs/stdio

oe-selftest-ubuntu ubuntu2004-ty-1
Comment 35 Alexandre Belloni 2023-08-02 14:17:50 UTC
https://autobuilder.yoctoproject.org/typhoon/#/builders/127/builds/1804/steps/14/logs/stdio

oe-selftest-armhost ubuntu2004-arm-1
Comment 36 Alexandre Belloni 2023-08-07 10:19:51 UTC
https://autobuilder.yoctoproject.org/typhoon/#/builders/87/builds/5579/steps/14/logs/stdio

oe-selftest-ubuntu ubuntu2004-ty-1
Comment 37 Alexandre Belloni 2023-08-10 13:48:46 UTC
https://autobuilder.yoctoproject.org/typhoon/#/builders/80/builds/5521/steps/14/logs/stdio

oe-selftest-debian debian11-ty-3
Comment 38 Alexandre Belloni 2023-08-10 14:18:14 UTC
https://autobuilder.yoctoproject.org/typhoon/#/builders/80/builds/5527/steps/14/logs/stdio

oe-selftest-debian debian11-ty-3
Comment 40 Alexandre Belloni 2023-08-17 19:59:35 UTC
https://autobuilder.yoctoproject.org/typhoon/#/builders/127/builds/1902/steps/14/logs/stdio

oe-selftest-armhost ubuntu2004-arm-1
Comment 41 Luca Ceresoli 2023-08-25 08:11:55 UTC
https://autobuilder.yoctoproject.org/typhoon/#/builders/80/builds/5595/steps/14/logs/stdio

oe-selftest-debian on debian11-ty-3
Comment 42 Alexandre Belloni 2023-09-07 14:26:19 UTC
https://autobuilder.yoctoproject.org/typhoon/#/builders/87/builds/5725/steps/14/logs/stdio

oe-selftest-ubuntu ubuntu2004-ty-1
Comment 43 Alexandre Belloni 2023-09-07 14:27:26 UTC
https://autobuilder.yoctoproject.org/typhoon/#/builders/80/builds/5653/steps/14/logs/stdio

oe-selftest-debian debian11-ty-1
Comment 44 Alexandre Belloni 2023-09-07 21:52:05 UTC
https://autobuilder.yoctoproject.org/typhoon/#/builders/80/builds/5577/steps/14/logs/stdio

oe-selftest-debian debian11-ty-1
Comment 45 Steve Sakoman 2023-09-14 19:09:59 UTC
mickledore:

https://autobuilder.yoctoproject.org/typhoon/#/builders/80/builds/5708

oe-selftest-debian debian11-ty-1
Comment 46 Richard Purdie 2023-09-18 12:53:41 UTC
*** Bug 14665 has been marked as a duplicate of this bug. ***
Comment 47 Alexandre Belloni 2023-09-21 16:47:44 UTC
https://autobuilder.yoctoproject.org/typhoon/#/builders/80/builds/5561/steps/14/logs/stdio

oe-selftest-debian debian11-ty-1
Comment 48 Randy MacLeod 2023-09-28 14:58:35 UTC
comment 33 is not relevant, it's a different bug.

Richard thinks that he has seen this on his own ubu-20.04 builder.
Comment 49 Randy MacLeod 2023-09-28 18:38:10 UTC
William (CCed now) will try to reproduce this issue over the coming week or so.
Comment 50 Alexandre Belloni 2023-10-05 20:39:52 UTC
https://autobuilder.yoctoproject.org/typhoon/#/builders/80/builds/5749/steps/14/logs/stdio

oe-selftest-debian debian11-ty-3
Comment 51 Alexandre Belloni 2023-10-05 22:03:34 UTC
https://autobuilder.yoctoproject.org/typhoon/#/builders/87/builds/5871/steps/14/logs/stdio

oe-selftest-ubuntu ubuntu2004-ty-1
Comment 52 Luca Ceresoli 2023-10-24 07:27:22 UTC
https://autobuilder.yoctoproject.org/typhoon/#/builders/87/builds/5969/steps/14/logs/stdio

oe-selftest-ubuntu on ubuntu2004-ty-1
Comment 53 Luca Ceresoli 2023-10-27 07:15:53 UTC
https://autobuilder.yoctoproject.org/typhoon/#/builders/127/builds/2335/steps/14/logs/stdio

oe-selftest-armhost on ubuntu2004-arm-1
Comment 54 Steve Sakoman 2023-11-20 16:18:43 UTC
nanbield:

https://autobuilder.yoctoproject.org/typhoon/#/builders/127/builds/2457/steps/14/logs/stdio
oe-selftest-armhost ubuntu2004-arm-1
Comment 56 Alexandre Belloni 2023-12-10 00:08:28 UTC
https://autobuilder.yoctoproject.org/typhoon/#/builders/80/builds/5974/steps/14/logs/stdio

oe-selftest-debian debian11-ty-1
Comment 57 Alexandre Belloni 2023-12-11 23:29:46 UTC
https://autobuilder.yoctoproject.org/typhoon/#/builders/87/builds/5787/steps/14/logs/stdio

oe-selftest-ubuntu ubuntu2004-ty-1
Comment 58 Alexandre Belloni 2023-12-11 23:38:26 UTC
https://autobuilder.yoctoproject.org/typhoon/#/builders/127/builds/2303/steps/14/logs/stdio

oe-selftest-armhost ubuntu2004-arm-1
Comment 59 Alexandre Belloni 2023-12-12 09:33:37 UTC
https://autobuilder.yoctoproject.org/typhoon/#/builders/87/builds/5705/steps/14/logs/stdio

oe-selftest-ubuntu ubuntu2004-ty-1
Comment 61 Javier Tia 2024-12-23 17:39:23 UTC
I am seeing this problem again. I am not sure what triggered it because I changed to a faster HW, upgraded Python to v3.13.1, and started using poky from master (commit: 284a08b6e4076).

I am not sure how to reproduce it because the failure is random. It looks like a concurrency problem.

Please let me know if I can provide more information.

I think this bug should be reopened.
Comment 62 Richard Purdie 2024-12-24 23:29:03 UTC
There are a lot of different reasons an issue like this could occur. Rather than reopen a bug which was tracked down to a specific issue, I'd suggest opening a new one so that we can log the specific details of your situation.

In order to look into it in any detail we will need more information as there isn't enough to go on right now.

Are there any trackbacks in bitbake-cookerdaemon.log?

I'm doubtful it is python 3.13 as mentioned elsewhere as we have autobuilder workers with python 3.13 on and it is working there.
Comment 63 Javier Tia 2024-12-24 23:34:17 UTC
OK. Returning it to the previous state. I will open a new one with more information. Thanks!