https://autobuilder.yoctoproject.org/typhoon/#/builders/82/builds/4910/steps/13/logs/stdio qemuarm64-ptest ubuntu1804-arm-1
====================================================================== FAIL: test_thread_time (test.test_time.TimeTestCase.test_thread_time) ---------------------------------------------------------------------- Traceback (most recent call last): File "/usr/lib/python3.11/test/test_time.py", line 523, in test_thread_time self.assertLess(stop - start, 0.020) AssertionError: 0.1065535400000499 not less than 0.02 ---------------------------------------------------------------------- Ran 59 tests in 2.108s FAILED (failures=1, skipped=3) test test_time failed 0:41:07 load avg: 0.70 [360/431/3] test_timeit -- test_time failed (1 failure)
Probably a time-sensitive test, if so we should just skip it.
Fixed in https://git.yoctoproject.org/poky/commit/?id=e56b895866c941a71fd495727e360c534b5c9898 *** This bug has been marked as a duplicate of bug 15177 ***