Many tests are sometimes failing because the image doesn't have any space left: FAIL: printpath-umovestr.gen.test sh: write error: No space left on device sh: write error: No space left on device sh: write error: No space left on device sh: write error: No space left on device make: *** [Makefile:17936: printpath-umovestr.gen.log] Error 1 sh: write error: No space left on device FAIL: read-write.gen.test sh: write error: No space left on device sh: write error: No space left on device sh: write error: No space left on device sh: write error: No space left on device make: *** [Makefile:17936: read-write.gen.log] Error 1 sh: write error: No space left on device FAIL: readahead.gen.test sh: write error: No space left on device sh: write error: No space left on device sh: write error: No space left on device sh: write error: No space left on device make: *** [Makefile:17936: readahead.gen.log] Error 1 sh: write error: No space left on device FAIL: readlink.gen.test sh: write error: No space left on device sh: write error: No space left on device sh: write error: No space left on device sh: write error: No space left on device make: *** [Makefile:17936: readlink.gen.log] Error 1 sh: write error: No space left on device FAIL: readdir.gen.test sh: write error: No space left on device sh: write error: No space left on device sh: write error: No space left on device sh: write error: No space left on device make: *** [Makefile:17936: readdir.gen.log] Error 1 sh: write error: No space left on device FAIL: reboot.gen.test sh: write error: No space left on device sh: write error: No space left on device sh: write error: No space left on device sh: write error: No space left on device make: *** [Makefile:17936: reboot.gen.log] Error 1 sh: write error: No space left on device FAIL: readlinkat.gen.test sh: write error: No space left on device sh: write error: No space left on device sh: write error: No space left on device sh: write error: No space left on device make: *** [Makefile:17936: readlinkat.gen.log] Error 1 sh: write error: No space left on device FAIL: recv-MSG_TRUNC.gen.test sh: write error: No space left on device sh: write error: No space left on device sh: write error: No space left on device sh: write error: No space left on device make: *** [Makefile:17936: recv-MSG_TRUNC.gen.log] Error 1 sh: write error: No space left on device FAIL: recvfrom.gen.test sh: write error: No space left on device sh: write error: No space left on device sh: write error: No space left on device sh: write error: No space left on device make: *** [Makefile:17936: recvfrom.gen.log] Error 1 sh: write error: No space left on device FAIL: recvfrom-MSG_TRUNC.gen.test sh: write error: No space left on device sh: write error: No space left on device sh: write error: No space left on device sh: write error: No space left on device make: *** [Makefile:17936: recvfrom-MSG_TRUNC.gen.log] Error 1 sh: write error: No space left on device FAIL: recvmmsg-timeout.gen.test sh: write error: No space left on device sh: write error: No space left on device sh: write error: No space left on device sh: write error: No space left on device make: *** [Makefile:17936: recvmmsg-timeout.gen.log] Error 1 sh: write error: No space left on device FAIL: recvmsg.gen.test sh: write error: No space left on device sh: write error: No space left on device sh: write error: No space left on device sh: write error: No space left on device make: *** [Makefile:17936: recvmsg.gen.log] Error 1 ../build-aux/test-driver: line 111: can't create regex.gen.log: No space left on device make: *** [Makefile:17936: regex.gen.log] Error 1 sh: write error: No space left on device FAIL: remap_file_pages.gen.test sh: write error: No space left on device sh: write error: No space left on device sh: write error: No space left on device sh: write error: No space left on device make: *** [Makefile:17936: remap_file_pages.gen.log] Error 1 sh: write error: No space left on device FAIL: remap_file_pages-Xabbrev.gen.test sh: write error: No space left on device sh: write error: No space left on device sh: write error: No space left on device sh: write error: No space left on device make: *** [Makefile:17936: remap_file_pages-Xabbrev.gen.log] Error 1 sh: write error: No space left on device FAIL: remap_file_pages-Xraw.gen.test sh: write error: No space left on device sh: write error: No space left on device sh: write error: No space left on device sh: write error: No space left on device make: *** [Makefile:17936: remap_file_pages-Xraw.gen.log] Error 1 sh: write error: No space left on device FAIL: remap_file_pages-Xverbose.gen.test sh: write error: No space left on device sh: write error: No space left on device sh: write error: No space left on device sh: write error: No space left on device make: *** [Makefile:17936: remap_file_pages-Xverbose.gen.log] Error 1 sh: write error: No space left on device FAIL: rename.gen.test sh: write error: No space left on device sh: write error: No space left on device sh: write error: No space left on device sh: write error: No space left on device make: *** [Makefile:17936: rename.gen.log] Error 1 sh: write error: No space left on device FAIL: renameat.gen.test sh: write error: No space left on device sh: write error: No space left on device sh: write error: No space left on device sh: write error: No space left on device make: *** [Makefile:17936: renameat.gen.log] Error 1 sh: write error: No space left on device FAIL: renameat2.gen.test ../build-aux/test-driver: line 140: can't create renameat2.gen.trs: No space left on device ../build-aux/test-driver: line 141: can't create renameat2.gen.trs: No space left on device ../build-aux/test-driver: line 142: can't create renameat2.gen.trs: No space left on device ../build-aux/test-driver: line 143: can't create renameat2.gen.trs: No space left on device make: *** [Makefile:17936: renameat2.gen.log] Error 1 https://autobuilder.yoctoproject.org/typhoon/#/builders/81/builds/5677/steps/12/logs/stdio
I suspect this is due to the parallelism that was enabled. The space wasn't increased. The space is set in the ptest recipe: IMAGE_ROOTFS_EXTRA_SPACE:virtclass-mcextend-strace = "1024288"
https://autobuilder.yoctoproject.org/typhoon/#/builders/81/builds/5662/steps/12/logs/stdio qemux86-64-ptest fedora38-ty-6
https://autobuilder.yoctoproject.org/typhoon/#/builders/81/builds/5692/steps/12/logs/stdio qemux86-64-ptest fedora38-ty-4
https://autobuilder.yoctoproject.org/typhoon/#/builders/81/builds/5682/steps/12/logs/stdio qemux86-64-ptest fedora38-ty-1
fc424293b22b strace: further clean up of ptest folders https://git.yoctoproject.org/poky/commit/?id=8fa77bf2f1f782ad42ef8d6131b7947840e881e6
https://autobuilder.yoctoproject.org/typhoon/#/builders/81/builds/5910/steps/12/logs/stdio qemux86-64-ptest alma9-ty-1
https://autobuilder.yoctoproject.org/typhoon/#/builders/81/builds/5942/steps/13/logs/stdio qemux86-64-ptest stream8-ty-1
https://autobuilder.yoctoproject.org/typhoon/#/builders/81/builds/5876/steps/12/logs/stdio qemux86-64-ptest fedora38-ty-6
https://autobuilder.yoctoproject.org/typhoon/#/builders/81/builds/5667/steps/12/logs/stdio qemux86-64-ptest fedora38-ty-1
https://autobuilder.yoctoproject.org/typhoon/#/builders/81/builds/5880/steps/12/logs/stdio qemux86-64-ptest ubuntu2004-ty-1
https://autobuilder.yoctoproject.org/typhoon/#/builders/81/builds/5985/steps/13/logs/stdio qemux86-64-ptest opensuse154-ty-3
https://autobuilder.yoctoproject.org/typhoon/#/builders/81/builds/6054/steps/12/logs/stdio qemux86-64-ptest fedora38-ty-4 this one had many many tests failing, I'm not sure why as the latest patch should have been making enough space for those to run.
https://autobuilder.yoctoproject.org/typhoon/#/builders/81/builds/6111/steps/13/logs/stdio qemux86-64-ptest opensuse154-ty-2
https://autobuilder.yoctoproject.org/typhoon/#/builders/81/builds/6082/steps/12/logs/stdio qemux86-64-ptest fedora38-ty-6
https://autobuilder.yoctoproject.org/typhoon/#/builders/81/builds/6077/steps/13/logs/stdio qemux86-64-ptest opensuse154-ty-2
https://autobuilder.yoctoproject.org/typhoon/#/builders/81/builds/5956/steps/12/logs/stdio qemux86-64-ptest alma9-ty-1
https://autobuilder.yoctoproject.org/typhoon/#/builders/81/builds/5954/steps/12/logs/stdio qemux86-64-ptest fedora38-ty-4
https://autobuilder.yoctoproject.org/typhoon/#/builders/81/builds/5836/steps/13/logs/stdio qemux86-64-ptest opensuse153-ty-1
https://autobuilder.yoctoproject.org/typhoon/#/builders/81/builds/5811/steps/12/logs/stdio qemux86-64-ptest fedora38-ty-4
https://autobuilder.yoctoproject.org/typhoon/#/builders/81/builds/5761/steps/12/logs/stdio qemux86-64-ptest fedora38-ty-4
https://autobuilder.yoctoproject.org/typhoon/#/builders/81/builds/5677/steps/12/logs/stdio qemux86-64-ptest fedora38-ty-6
https://autobuilder.yoctoproject.org/typhoon/#/builders/81/builds/5657/steps/12/logs/stdio qemux86-64-ptest fedora38-ty-1
https://autobuilder.yoctoproject.org/typhoon/#/builders/81/builds/5723/steps/12/logs/stdio qemux86-64-ptest ubuntu2204-ty-3
https://autobuilder.yoctoproject.org/typhoon/#/builders/81/builds/5721/steps/12/logs/stdio qemux86-64-ptest ubuntu2004-ty-1
https://autobuilder.yoctoproject.org/typhoon/#/builders/81/builds/5739/steps/12/logs/stdio qemux86-64-ptest fedora38-ty-5
https://autobuilder.yoctoproject.org/typhoon/#/builders/81/builds/5737/steps/12/logs/stdio qemux86-64-ptest fedora38-ty-6
https://autobuilder.yoctoproject.org/typhoon/#/builders/81/builds/5736/steps/13/logs/stdio qemux86-64-ptest opensuse154-ty-2
https://autobuilder.yoctoproject.org/typhoon/#/builders/81/builds/5732/steps/12/logs/stdio qemux86-64-ptest fedora38-ty-2
A series introducing basic guest/host disk space statistics has been merged on master and now allows to get disk statistics on failed runtime tests. To retrieve the corresponding stats, heads public artifacts server (https://autobuilder.yocto.io/pub/) and navigate to non-release/<job_id>/testresults/<builder>/artifacts
No occurrence after growing the rootfs size.