Not so intermittent, 100% reproducible on debian workers, as parted is missing. 2025-04-20 12:40:15,938 - oe-selftest - INFO - wic.Wic.test_exclude_path_with_extra_space (subunit.RemotedTestCase) 2025-04-20 12:40:15,939 - oe-selftest - INFO - ... FAIL ... 2025-04-20 12:40:15,939 - oe-selftest - INFO - 5: 41/64 384/624 (64.94s) (0 failed) (wic.Wic.test_exclude_path_with_extra_space) 2025-04-20 12:40:15,939 - oe-selftest - INFO - testtools.testresult.real._StringException: Traceback (most recent call last): File "/srv/pokybuild/yocto-worker/oe-selftest-debian/build/meta/lib/oeqa/selftest/cases/wic.py", line 568, in test_exclude_path_with_extra_space size_of_root_partition = int(runCmd("wic ls %s" % wicout).output.split('\n')[2].split()[3]) File "/srv/pokybuild/yocto-worker/oe-selftest-debian/build/meta/lib/oeqa/utils/commands.py", line 214, in runCmd raise AssertionError("Command '%s' returned non-zero exit status %d:\n%s" % (command, result.status, exc_output)) AssertionError: Command 'wic ls /srv/pokybuild/yocto-worker/oe-selftest-debian/build/build-st-3846829/tmp/deploy/images/qemux86-64/core-image-minimal-qemux86-64.rootfs-20250420123932.wic' returned non-zero exit status 1: ERROR: Can't find executable parted
oe-selftest-debian debian11-vk-1 mathieu/master-next completed at 2025-04-20T14:41:42Z https://autobuilder.yoctoproject.org/valkyrie/#/builders/35/builds/1385/steps/14/logs/stdio oe-selftest-debian debian12-vk-9 mathieu/master-next completed at 2025-04-21T15:59:41Z https://autobuilder.yoctoproject.org/valkyrie/#/builders/35/builds/1389/steps/14/logs/stdio oe-selftest-debian debian12-vk-8 master-next completed at 2025-04-18T23:40:24Z https://autobuilder.yoctoproject.org/valkyrie/#/builders/35/builds/1381/steps/14/logs/stdio oe-selftest-debian debian11-vk-3 mathieu/master-next completed at 2025-04-22T11:36:44Z https://autobuilder.yoctoproject.org/valkyrie/#/builders/35/builds/1395/steps/14/logs/stdio oe-selftest-debian debian11-vk-1 master completed at 2025-04-22T03:18:01Z https://autobuilder.yoctoproject.org/valkyrie/#/builders/35/builds/1393/steps/14/logs/stdio oe-selftest-debian debian12-vk-1 mathieu/master-next completed at 2025-04-23T06:24:15Z https://autobuilder.yoctoproject.org/valkyrie/#/builders/35/builds/1402/steps/14/logs/stdio
oe-selftest-debian debian11-vk-2 master completed at 2025-04-24T02:47:13Z https://autobuilder.yoctoproject.org/valkyrie/#/builders/35/builds/1410/steps/14/logs/stdio oe-selftest-debian debian11-vk-2 mathieu/master-next completed at 2025-04-24T11:56:44Z https://autobuilder.yoctoproject.org/valkyrie/#/builders/35/builds/1412/steps/14/logs/stdio
Richard has replied on the mail list with a fix suggestion that does not involve installing anything on the debian workers.
Raised to a high priority since this is going to continue to happen on the YP AB.
oe-selftest-debian debian12-vk-7 mathieu/master-next completed at 2025-04-27T09:26:44Z https://autobuilder.yoctoproject.org/valkyrie/#/builders/35/builds/1433/steps/14/logs/stdio oe-selftest-debian debian11-vk-2 master completed at 2025-04-28T02:39:55Z https://autobuilder.yoctoproject.org/valkyrie/#/builders/35/builds/1437/steps/14/logs/stdio
patch submitted: https://lists.openembedded.org/g/openembedded-core/topic/patch_oe_selftest_wic_add/112501814
oe-selftest-debian debian12-vk-9 master completed at 2025-04-29T02:38:41Z https://autobuilder.yoctoproject.org/valkyrie/#/builders/35/builds/1446/steps/14/logs/stdio
new patch submitted: https://lists.openembedded.org/g/openembedded-core/topic/patch_v3_oe_selftest_wic/112553763
new patch succeeding on a debian worker on the AB: https://autobuilder.yoctoproject.org/valkyrie/#/builders/35/builds/1460/steps/14/logs/stdio (line #1250)