Bug 16412 - AB-INT PTEST: python3 ptest failure: in test_attach_to_process_without_colors
Summary: AB-INT PTEST: python3 ptest failure: in test_attach_to_process_without_colors
Status: RESOLVED FIXED
Alias: None
Product: Package Testing (ptest)
Classification: QA/Testing
Component: ptest (show other bugs)
Version: unspecified
Hardware: x86 Multiple
: Medium normal
Target Milestone: 6.1
Assignee: Pratik Farkase
QA Contact:
URL:
Whiteboard: AB-INT
Depends on:
Blocks:
 
Reported: 2026-08-31 09:38 UTC by João Marcos Costa
Modified: 2026-09-10 15:08 UTC (History)
2 users (show)

See Also:
OS type for building Yocto: ---
Type of Regression: ---
Verified:
Documentation change: Don't know


Attachments

Note You need to log in before you can comment on or make changes to this bug.
Description João Marcos Costa 2026-08-31 09:38:08 UTC
https://autobuilder.yoctoproject.org/valkyrie/#/builders/61/builds/4413/steps/15/logs/stdio

Failed ptests:
{'python3': ['test_attach_to_process_without_colors', 'python3']}

qemuarm64-ptest ubuntu2604-vk-arm1

---

Full logs at https://valkyrie.yocto.io/pub/non-release/20260830-58/testresults/qemuarm64-ptest/python3.log

"""
======================================================================
FAIL: test_attach_to_process_without_colors (test.test_remote_pdb.PdbAttachTestCase.test_attach_to_process_without_colors)
----------------------------------------------------------------------
Traceback (most recent call last):
  File "/usr/lib/python3.14/test/test_remote_pdb.py", line 1606, in test_attach_to_process_without_colors
    self.assertEqual(output["server"]["stdout"], "Function returned: 42\n")
    ~~~~~~~~~~~~~~~~^^^^^^^^^^^^^^^^^^^^^^^^^^^^^^^^^^^^^^^^^^^^^^^^^^^^^^^
AssertionError: 'Function returned: 1\n' != 'Function returned: 42\n'
- Function returned: 1
?                    ^
+ Function returned: 42
?                    ^^


----------------------------------------------------------------------
Ran 45 tests in 12.544s

FAILED (failures=1, skipped=1)
test test_remote_pdb failed
"""