Bug 1697 - Qemux86-64 lsb images build failed with 20111023 build due to do_compile failed for qt-x11-free package
Summary: Qemux86-64 lsb images build failed with 20111023 build due to do_compile fail...
Status: RESOLVED FIXED
Alias: None
Product: OE-Core
Classification: Build System, Metadata & Runtime
Component: core (show other bugs)
Version: unspecified
Hardware: x86 x86_64
: Medium normal
Target Milestone: 1.2
Assignee: Saul Wold
QA Contact:
URL:
Whiteboard:
Depends on:
Blocks:
 
Reported: 2011-10-24 21:44 UTC by wenhua.fan
Modified: 2011-11-24 15:15 UTC (History)
9 users (show)

See Also:
OS type for building Yocto: ---
Type of Regression: ---
Verified:
Documentation change: ---


Attachments

Note You need to log in before you can comment on or make changes to this bug.
Description wenhua.fan 2011-10-24 21:44:05 UTC
The rules file q3porting.xml couldn't find or some useful files couldn't parse cause do_compile failed for qt-x11-free package.

Commit information as below:

Tree/branch : poky-contrib/master_under_test
Commit id: 88d7de9aa239bbb47245afc13d3a3e9689e9ebfb

Details information could be found at :

http://autobuilder.yoctoproject.org:8010/builders/nightly-x86-64/builds/144/steps/shell_51/logs/stdio

Part of error log as below:

########
| /home/pokybuild/yocto-autobuilder/yocto-slave/nightly-x86-64/build/build/tmp/sysroots/x86_64-linux/usr/bin/uic3 finddialog.ui -o finddialog.h
| Error: Could not find rules file: q3porting.xml
| Error: Could not find rules file: q3porting.xml
| Error: Could not find rules file: q3porting.xml
| Error: Could not find rules file: q3porting.xml
| Error: Could not find rules file: q3porting.xml
| /home/pokybuild/yocto-autobuilder/yocto-slave/nightly-x86-64/build/build/tmp/sysroots/x86_64-linux/usr/bin/uic3 replacedialog.ui -o replacedialog.h
| Error: Could not find rules file: q3porting.xml
| Error: Could not find rules file: q3porting.xml
| /home/pokybuild/yocto-autobuilder/yocto-slave/nightly-x86-64/build/build/tmp/sysroots/x86_64-linux/usr/bin/uic3 gotolinedialog.ui -o gotolinedialog.h
| Error: Could not find rules file: q3porting.xml
........
| make[2]: *** [newformimpl.o] Error 1
| make[2]: *** Waiting for unfinished jobs....
| In file included from listboxeditorimpl.h:33:0,
|                  from listboxeditorimpl.cpp:27:
| listboxeditor.h:7:42: fatal error: Qt3Support/Q3MimeSourceFactory: No such file or directory
| compilation terminated.
| make[2]: *** [listboxeditorimpl.o] Error 1
| In file included from customwidgeteditorimpl.h:30:0,
|                  from customwidgeteditorimpl.cpp:27:
| customwidgeteditor.h:7:31: fatal error: Qt3Support/Q3Header: No such file or directory
| compilation terminated.
| In file included from listvieweditorimpl.h:30:0,
|                  from listvieweditorimpl.cpp:29:
| listvieweditor.h:7:31: fatal error: Qt3Support/Q3Header: No such file or directory
| compilation terminated.
| make[2]: *** [customwidgeteditorimpl.o] Error 1
| make[2]: *** [listvieweditorimpl.o] Error 1
| In file included from multilineeditorimpl.h:33:0,
|                  from multilineeditorimpl.cpp:27:
| multilineeditor.h:7:42: fatal error: Qt3Support/Q3MimeSourceFactory: No such file or directory
| compilation terminated.
| make[2]: *** [multilineeditorimpl.o] Error 1
| In file included from iconvieweditorimpl.h:30:0,
|                  from iconvieweditorimpl.cpp:27:
| iconvieweditor.h:7:42: fatal error: Qt3Support/Q3MimeSourceFactory: No such file or directory
| compilation terminated.
| make[2]: *** [iconvieweditorimpl.o] Error 1
| In file included from formsettingsimpl.h:30:0,
|                  from formsettingsimpl.cpp:27:
| formsettings.h:7:42: fatal error: Qt3Support/Q3MimeSourceFactory: No such file or directory
| compilation terminated.
| make[2]: *** [formsettingsimpl.o] Error 1
| In file included from actioneditorimpl.h:30:0,
|                  from command.cpp:35:
| actioneditor.h:8:27: fatal error: QtCore/QVariant: No such file or directory
| compilation terminated.
########
Comment 1 Richard Purdie 2011-11-24 15:15:18 UTC
I think this was related to various sstate issues. Certainly its not showing up now despite some heavy rebuilds on the autobuilder so I'm going to assume this is fixed. Please reopen if this shows up again.