logs info: checking whether /srv/home/pokybuild/yocto-autobuilder/yocto-slave/fri2-noemgd/build/build/tmp/work/core2-poky-linux/gcc-cross-initial-4.6.2+svnr181430-r22/gcc-4_6-branch/build.x86_64-linux.i586-poky-linux/./gcc/xgcc -B/srv/home/pokybuild/yocto-autobuilder/yocto-slave/fri2-noemgd/build/build/tmp/work/core2-poky-linux/gcc-cross-initial-4.6.2+svnr181430-r22/gcc-4_6-branch/build.x86_64-linux.i586-poky-linux/./gcc/ -m32 -march=core2 -msse3 -mtune=generic -mfpmath=sse -isystem/srv/hERROR: Function failed: do_compile (see /srv/home/pokybuild/yocto-autobuilder/yocto-slave/fri2-noemgd/build/build/tmp/work/core2-poky-linux/gcc-cross-initial-4.6.2+svnr181430-r22/temp/log.do_compile.27197 for further information) | ome/pokybuild/yocto-autobuilder/yocto-slave/fri2-noemgd/build/build/tmp/sysroots/fri2-noemgd/usr/include -B/srv/home/pokybuild/yocto-autobuilder/yocto-slave/fri2-noemgd/build/build/tmp/sysroots/x86_64-linux/usr/i586-poky-linux/bin/ -B/srv/home/pokybuild/yocto-autobuilder/yocto-slave/fri2-noemgd/build/build/tmp/sysroots/x86_64-linux/usr/i586-poky-linux/lib/ -isystem /srv/home/pokybuild/yocto-autobuilder/yocto-slave/fri2-noemgd/build/build/tmp/sysroots/x86_64-linux/usr/i586-poky-linux/include -isystem /srv/home/pokybuild/yocto-autobuilder/yocto-slave/fri2-noemgd/build/build/tmp/sysroots/x86_64-linux/usr/i586-poky-linux/sys-include --sysroot=/srv/home/pokybuild/yocto-autobuilder/yocto-slave/fri2-noemgd/build/build/tmp/sysroots/fri2-noemgd accepts -g... yes | checking for /srv/home/pokybuild/yocto-autobuilder/yocto-slave/fri2-noemgd/build/build/tmp/work/core2-poky-linux/gcc-cross-initial-4.6.2+svnr181430-r22/gcc-4_6-branch/build.x86_64-linux.i586-poky-linux/./gcc/xgcc -B/srv/home/pokybuild/yocto-autobuilder/yocto-slave/fri2-noemgd/build/build/tmp/work/core2-poky-linux/gcc-cross-initial-4.6.2+svnr181430-r22/gcc-4_6-branch/build.x86_64-linux.i586-poky-linux/./gcc/ -m32 -march=core2 -msse3 -mtune=generic -mfpmath=sse -isystem/srv/home/pokybuild/yocto-autobuilder/yocto-slave/fri2-noemgd/build/build/tmp/sysroots/fri2-noemgd/usr/include -B/srv/home/pokybuild/yocto-autobuilder/yocto-slave/fri2-noemgd/build/build/tmp/sysroots/x86_64-linux/usr/i586-poky-linux/bin/ -B/srv/home/pokybuild/yocto-autobuilder/yocto-slave/fri2-noemgd/build/build/tmp/sysroots/x86_64-linux/usr/i586-poky-linux/lib/ -isystem /srv/home/pokybuild/yocto-autobuilder/yocto-slave/fri2-noemgd/build/build/tmp/sysroots/x86_64-linux/usr/i586-poky-linux/include -isystem /srv/home/pokybuild/yocto-autobuilder/yocto-slave/fri2-noemgd/build/build/tmp/sysroots/x86_64-linux/usr/i586-poky-linux/sys-include --sysroot=/srv/home/pokybuild/yocto-autobuilder/yocto-slave/fri2-noemgd/build/build/tmp/sysroots/fri2-noemgd option to accept ISO C89... none needed | checking how to run the C preprocessor... /srv/home/pokybuild/yocto-autobuilder/yocto-slave/fri2-noemgd/build/build/tmp/work/core2-poky-linux/gcc-cross-initial-4.6.2+svnr181430-r22/gcc-4_6-branch/build.x86_64-linux.i586-poky-linux/./gcc/xgcc -B/srv/home/pokybuild/yocto-autobuilder/yocto-slave/fri2-noemgd/build/build/tmp/work/core2-poky-linux/gcc-cross-initial-4.6.2+svnr181430-r22/gcc-4_6-branch/build.x86_64-linux.i586-poky-linux/./gcc/ -E | configure: error: in `/srv/home/pokybuild/yocto-autobuilder/yocto-slave/fri2-noemgd/build/build/tmp/work/core2-poky-linux/gcc-cross-initial-4.6.2+svnr181430-r22/gcc-4_6-branch/build.x86_64-linux.i586-poky-linux/i586-poky-linux/libgcc': | configure: error: C preprocessor "/srv/home/pokybuild/yocto-autobuilder/yocto-slave/fri2-noemgd/build/build/tmp/work/core2-poky-linux/gcc-cross-initial-4.6.2+svnr181430-r22/gcc-4_6-branch/build.x86_64-linux.i586-poky-linux/./gcc/xgcc -B/srv/home/pokybuild/yocto-autobuilder/yocto-slave/fri2-noemgd/build/build/tmp/work/core2-poky-linux/gcc-cross-initial-4.6.2+svnr181430-r22/gcc-4_6-branch/build.x86_64-linux.i586-poky-linux/./gcc/ -E" fails sanity check | See `config.log' for more details. | make[1]: *** [configure-target-libgcc] Error 1 | make[1]: Leaving directory `/srv/home/pokybuild/yocto-autobuilder/yocto-slave/fri2-noemgd/build/build/tmp/work/core2-poky-linux/gcc-cross-initial-4.6.2+svnr181430-r22/gcc-4_6-branch/build.x86_64-linux.i586-poky-linux' | make: *** [all] Error 2 | ERROR: oe_runmake failed
Jessica, can you provide steps to reproduce the issue ? Nitin
Here's the setup of AB that ran into the issue: yocto-autobuild 'core-image-lsb core-image-lsb-sdk' -k in dir /srv/home/pokybuild/yocto-autobuilder/yocto-slave/fri2-noemgd/build (timeout 14400 secs) watching logfiles {} argv: ['yocto-autobuild', 'core-image-lsb core-image-lsb-sdk', '-k'] environment: ABTARGET=fri2-noemgd BSP_BRANCH=master BSP_REPO=git://git.pokylinux.org/meta-intel.git BSP_REV=HEAD BSP_WORKDIR=build/yocto/meta-intel BTARGET=fri2 BUILDSTRING= BUILD_PUBLISH_DIR=/srv/www/vhosts/autobuilder.yoctoproject.org/pub/ CLEAN_SOURCE_DIR=False COLORTERM=1 CPU=x86_64 CSHEDIT=emacs CVS_RSH=ssh DEST= DISTRO=poky-lsb DL_DIR=/srv/www/vhosts/autobuilder.yoctoproject.org/current_sources EDITOR=vim ENABLE_SWABBER=false FROM_HEADER= FuzzArch= FuzzImage= FuzzSDK= GIT_PROXY_COMMAND=/usr/local/bin/git-proxy GPG_TTY=/dev/pts/0 G_BROKEN_FILENAMES=1 G_FILENAME_ENCODING=@locale,UTF-8,ISO-8859-15,CP1252 HISTSIZE=1000 HOME=/srv/home/pokybuild HOST=yocto-iab08 HOSTNAME=yocto-iab08 HOSTTYPE=x86_64 INPUTRC=/etc/inputrc LANG=en_US.UTF-8 LD_LIBRARY_PATH=/usr/lib64/mpi/gcc/openmpi/lib64 LESS=-M -I -R LESSCLOSE=lessclose.sh %s %s LESSKEY=/etc/lesskey.bin LESSOPEN=lessopen.sh %s LESS_ADVANCED_PREPROCESSOR=no LOGNAME=pokybuild LSB_SSTATE_DIR=/srv/www/vhosts/autobuilder.yoctoproject.org/pub/lsb-sstate LS_COLORS=no=00:fi=00:di=01;34:ln=00;36:pi=40;33:so=01;35:do=01;35:bd=40;33;01:cd=40;33;01:or=41;33;01:ex=00;32:*.cmd=00;32:*.exe=01;32:*.com=01;32:*.bat=01;32:*.btm=01;32:*.dll=01;32:*.tar=00;31:*.tbz=00;31:*.tgz=00;31:*.rpm=00;31:*.deb=00;31:*.arj=00;31:*.taz=00;31:*.lzh=00;31:*.lzma=00;31:*.zip=00;31:*.zoo=00;31:*.z=00;31:*.Z=00;31:*.gz=00;31:*.bz2=00;31:*.tb2=00;31:*.tz2=00;31:*.tbz2=00;31:*.xz=00;31:*.avi=01;35:*.bmp=01;35:*.fli=01;35:*.gif=01;35:*.jpg=01;35:*.jpeg=01;35:*.mng=01;35:*.mov=01;35:*.mpg=01;35:*.pcx=01;35:*.pbm=01;35:*.pgm=01;35:*.png=01;35:*.ppm=01;35:*.tga=01;35:*.tif=01;35:*.xbm=01;35:*.xpm=01;35:*.dl=01;35:*.gl=01;35:*.wmv=01;35:*.aiff=00;32:*.au=00;32:*.mid=00;32:*.mp3=00;32:*.ogg=00;32:*.voc=00;32:*.wav=00;32: LS_OPTIONS=-N --color=tty -T 0 MACHINE=fri2-noemgd MACHTYPE=x86_64-suse-linux MAIL=/var/spool/mail/pokybuild MAKEFLAGS= MAKELEVEL=1 MANPATH=/usr/lib64/mpi/gcc/openmpi/share/man:/usr/local/man:/usr/share/man MFLAGS= MINICOM=-c on MORE=-sl NNTPSERVER=news NO_PROXY=localhost, 127.0.0.1, intel.com, 10.0.0.0/8 OLDPWD=/srv/home/pokybuild OSTYPE=linux PAGER=less PATH=/srv/home/pokybuild/yocto-autobuilder/bin:/srv/home/pokybuild/yocto-autobuilder/yocto-autobuilder/scripts:/usr/lib64/mpi/gcc/openmpi/bin:/usr/local/bin:/usr/bin:/bin:/usr/bin/X11:/usr/X11R6/bin:/usr/games PROFILEREAD=true PUBLISH_BUILDS=True PUBLISH_SOURCE_MIRROR=True PUBLISH_SSTATE=False PWD=/srv/home/pokybuild/yocto-autobuilder/yocto-slave/fri2-noemgd/build PYTHONPATH=/srv/home/pokybuild/yocto-autobuilder/lib/python2.6/site-packages/: PYTHONSTARTUP=/etc/pythonstart QT_SYSTEM_DIR=/usr/share/desktop-data RELEASE= REVISION=HEAD SDKMACHINE=x86_64 SHELL=/bin/bash SHLVL=1 SLAVEBASEDIR=/srv/home/pokybuild/yocto-autobuilder/yocto-slave SOURCE_DL_DIR=/srv/www/vhosts/autobuilder.yoctoproject.org/current_sources SOURCE_PUBLISH_DIR=/srv/www/vhosts/autobuilder.yoctoproject.org/pub/sources SOURCE_SSTATE_DIR=/srv/www/vhosts/autobuilder.yoctoproject.org/pub/sstate SSTATE_DIR=/srv/www/vhosts/autobuilder.yoctoproject.org/pub/sstate SSTATE_PUBLISH_DIR=/srv/www/vhosts/sstate.yoctoproject.org/ TERM=xterm USER=pokybuild WINDOWMANAGER=/usr/bin/twm WORKDIR= XCURSOR_THEME=DMZ XDG_CONFIG_DIRS=/etc/xdg XDG_DATA_DIRS=/usr/share XKEYSYMDB=/usr/X11R6/lib/X11/XKeysymDB XNLSPATH=/usr/share/X11/nls _=./yocto-start-autobuilder ftp_proxy=http://proxy.jf.intel.com:911/ http_proxy=http://proxy.jf.intel.com:911/ https_proxy=https://proxy.jf.intel.com:911/ machine= mc=() { . /usr/share/mc/mc-wrapper.sh }
Tried. Can not reproduce the issue locally. The build succeeded without any errors.
clean sstate on autobuilder dismissed the error
was not a bug