i586-poky-linux-gcc -m32 -march=i586 --sysroot=/srv/home/pokybuild/yocto-autobuilder/yocto-slave/nightly-world/build/build/tmp/sysroots/qemux86 -DHAVE_CONFIG_H -I. -I../src -I./../src -O2 -pipe -g -feliminate-unused-debug-types -std=gnu99 -W -Wstrict-prototypes -Wmissing-prototypes -Wall -Waggregate-return -Wcast-align -Wcast-qual -Wnested-externs -Wshadow -Wpointer-arith -pipe -c timewarp-file.c | sndfile-resample.c:30:21: fatal error: sndfile.h: No such file or directory | compilation terminated. | varispeed-play.c:31:21: fatal error: sndfile.h: No such file or directorymake[1]: *** [sndfile-resample.o] Error 1 | make[1]: *** Waiting for unfinished jobs.... | | compilation terminated. | audio_out.c:32:21: fatal error: sndfile.h: No such file or directory | compilation terminated. | make[1]: *** [varispeed-play.o] Error 1 | make[1]: *** [audio_out.o] Error 1 | timewarp-file.c:30:21: fatal error: sndfile.h: No such file or directory | compilation terminated. | make[1]: *** [timewarp-file.o] Error 1 | make[1]: Leaving directory `/srv/home/pokybuild/yocto-autobuilder/yocto-slave/nightly-world/build/build/tmp/work/i586-poky-linux/libsamplerate0-0.1.8-r0/libsamplerate-0.1.8/examples' | make: *** [all-recursive] Error 1 | ERROR: oe_runmake failed | ERROR: Function failed: do_compile (see /srv/home/pokybuild/yocto-autobuilder/yocto-slave/nightly-world/build/build/tmp/work/i586-poky-linux/libsamplerate0-0.1.8-r0/temp/log.do_compile.12997 for further information) NOTE: package libsamplerate0-0.1.8-r0: task do_compile: Failed Build Configuration: BB_VERSION = "1.15.3" TARGET_ARCH = "i586" TARGET_OS = "linux" MACHINE = "qemux86" DISTRO = "poky" DISTRO_VERSION = "1.2+snapshot-20120725" TUNE_FEATURES = "m32 i586" TARGET_FPU = "" meta meta-yocto = "master:0ffb02eec2beaea27ff0ec9d3d31b0a09e675a4c" meta-qt3 = "master:f8475d5c5935695d4d1dfff1d7be30f49e162094" Autobuilder log: http://autobuilder.yoctoproject.org:8010/builders/nightly-world/builds/190/steps/shell_34/logs/stdio
I was not able to replicate it. Did a git pull today, so: DISTRO_VERSION = "1.2+snapshot-20120726". libsamplerate0 compiled and build cleanly.
in that case it may be dependency issue. probably the recipe sndfile.h is not in the DEPENDS of the libsamplerate
which recipe provides sndfile.h ? try "bitbake clean"ning that recipe before testing.
(In reply to comment #3) > which recipe provides sndfile.h ? > try "bitbake clean"ning that recipe before testing. (In reply to comment #1) > I was not able to replicate it. > Did a git pull today, so: > DISTRO_VERSION = "1.2+snapshot-20120726". > > libsamplerate0 compiled and build cleanly. Hi Cristian, Do you have an update regarding this? Thanks, Alex.
Hello, Like I said previously, I was not able to replicate it. If a test case can be provided, I will investigate it. Regards, Cristian
Fixed in master by http://git.yoctoproject.org/cgit.cgi/poky/commit/?id=c7cadd17ab2f60d0f0560e7eb377675902a7ede0
Verified on master branch, commit ID:05a1f4a5a32c6cc392fa4480732101d668cd6f77