Bug 3861 - arm: ld: cannot find /lib/libpthread.so.0
Summary: arm: ld: cannot find /lib/libpthread.so.0
Status: RESOLVED DUPLICATE of bug 3667
Alias: None
Product: OE-Core
Classification: Build System, Metadata & Runtime
Component: devtools / tool chain (show other bugs)
Version: 1.4
Hardware: x86 Multiple
: Undecided normal
Target Milestone: ---
Assignee: Bogdan Marinescu
QA Contact:
URL:
Whiteboard: autobuilder
Depends on:
Blocks:
 
Reported: 2013-02-06 21:16 UTC by Nitin Kamble
Modified: 2013-02-06 23:52 UTC (History)
3 users (show)

See Also:
OS type for building Yocto: ---
Type of Regression: ---
Verified:
Documentation change: ---


Attachments

Note You need to log in before you can comment on or make changes to this bug.
Description Nitin Kamble 2013-02-06 21:16:32 UTC
ld is not able to find these files: /lib/libpthread.so.0 /usr/lib/libpthread_nonshared.a




Build status: FAILURE
Buildslave for this Build: ab10.i.yoctoproject.org 
Complete logs for all build steps: http://autobuilder.yoctoproject.org:8010/builders/nightly-fsl-arm/builds/66 
Build Reason: Triggerable(nightly-fsl-arm) 
Build Source Stamp: [branch master] 451f2d083d6c05454d2c3366bd09c7fb13fd8e47 
Detailed log of last build step: http://autobuilder.yoctoproject.org:8010/builders/nightly-fsl-arm/builds/66/steps/shell_71/logs/stdio 
Last 20 lines of "shell_71.stdio" Error log:
| arm-poky-linux-gnueabi-libtool: link: /bin/grep -E -e "^ga_" ".libs/libavahi-gobject.exp" > ".libs/libavahi-gobject.expT"
| arm-poky-linux-gnueabi-libtool: link: mv -f ".libs/libavahi-gobject.expT" ".libs/libavahi-gobject.exp"
| arm-poky-linux-gnueabi-libtool: link: echo "{ global:" > .libs/libavahi-gobject.ver
| arm-poky-linux-gnueabi-libtool: link: cat .libs/libavahi-gobject.exp | sed -e "s/\(.*\)/\1;/" >> .libs/libavahi-gobject.ver
| arm-poky-linux-gnueabi-libtool: link: echo "local: *; };" >> .libs/libavahi-gobject.ver
| arm-poky-linux-gnueabi-libtool: link: arm-poky-linux-gnueabi-gcc -march=armv7-a -mthumb-interwork -mfloat-abi=softfp -mfpu=neon --sysroot=/srv/home/pokybuild/yocto-autobuilder/yocto-slave/nightly-fsl-arm/build/build/tmp/sysroots/imx6qsabresd -std=gnu99 -shared -fPIC -DPIC .libs/libavahi_gobject_la-ga-client.o .libs/libavahi_gobject_la-ga-entry-group.o .libs/libavahi_gobject_la-ga-error.o .libs/libavahi_gobject_la-ga-record-browser.o .libs/libavahi_gobject_la-ga-service-browser.o .libs/libavahi_gobject_la-ga-service-resolver.o .libs/libavahi_gobject_la-signals-marshal.o .libs/libavahi_gobject_la-ga-client-enumtypes.o .libs/libavahi_gobject_la-ga-entry-group-enumtypes.o .libs/libavahi_gobject_la-ga-enums-enumtypes.o -L/srv/home/pokybuild/yocto-autobuilder/yocto-slave/nightly-fsl-arm/build/build/tmp/work/armv7a-vfp-neon-poky-linux-gnueabi/avahi/0.6.31-r6.1/avahi-0.6.31/avahi-common/.libs ../avahi-common/.libs/libavahi-common.so ../avahi-client/.libs/libavahi-client.so -L/srv/home/pokybuild/yocto-autobuilder/yocto-slave/nightly-fsl-arm/build/build/tmp/sysroots/imx53qsb/usr/lib /srv/home/pokybuild/yocto-autobuilder/yocto-slave/nightly-fsl-arm/build/build/tmp/sysroots/imx6qsabresd/usr/lib/libdbus-1.so -lrt -ldl ../avahi-glib/.libs/libavahi-glib.so /srv/home/pokybuild/yocto-autobuilder/yocto-slave/nightly-fsl-arm/build/build/tmp/work/armv7a-vfp-neon-poky-linux-gnueabi/avahi/0.6.31-r6.1/avahi-0.6.31/avahi-common/.libs/libavahi-common.so /srv/home/pokybuild/yocto-autobuilder/yocto-slave/nightly-fsl-arm/build/build/tmp/sysroots/imx6qsabresd/usr/lib/libgobject-2.0.so -L/srv/home/pokybuild/yocto-autobuilder/yocto-slave/nightly-fsl-arm/build/build/tmp/sysroots/imx6qsabresd/usr/lib /srv/home/pokybuild/yocto-autobuilder/yocto-slave/nightly-fsl-arm/build/build/tmp/sysroots/imx6qsabresd/usr/lib/libgthread-2.0.so /srv/home/pokybuild/yocto-autobuilder/yocto-slave/nightly-fsl-arm/build/build/tmp/sysroots/imx6qsabresd/usr/lib/libffi.so /srv/home/pokybuild/yocto-autobuilder/yocto-slave/nightly-fsl-arm/build/build/tmp/sysroots/imx6qsabresd/usr/lib/libglib-2.0.so -lpthread -march=armv7-a -mthumb-interwork -mfloat-abi=softfp -mfpu=neon --sysroot=/srv/home/pokybuild/yocto-autobuilder/yocto-slave/nightly-fsl-arm/build/build/tmp/sysroots/imx6qsabresd -O2 -Wl,-O1 -Wl,--hash-style=gnu -Wl,--as-needed -pthread -Wl,-soname -Wl,libavahi-gobject.so.0 -Wl,-version-script -Wl,.libs/libavahi-gobject.ver -o .libs/libavahi-gobject.so.0.0.4
| /srv/home/pokybuild/yocto-autobuilder/yocto-slave/nightly-fsl-arm/build/build/tmp/sysroots/x86_64-linux/usr/libexec/armv7a-vfp-neon-poky-linux-gnueabi/gcc/arm-poky-linux-gnueabi/4.7.2/ld: cannot find /lib/libpthread.so.0
| /srv/home/pokybuild/yocto-autobuilder/yocto-slave/nightly-fsl-arm/build/build/tmp/sysroots/x86_64-linux/usr/libexec/armv7a-vfp-neon-poky-linux-gnueabi/gcc/arm-poky-linux-gnueabi/4.7.2/ld: cannot find /usr/lib/libpthread_nonshared.a
| collect2: error: ld returned 1 exit status
| make[3]: *** [libavahi-gobject.la] Error 1
| make[3]: Leaving directory `/srv/home/pokybuild/yocto-autobuilder/yocto-slave/nightly-fsl-arm/build/build/tmp/work/armv7a-vfp-neon-poky-linux-gnueabi/avahi/0.6.31-r6.1/avahi-0.6.31/avahi-gobject'
| make[2]: *** [all] Error 2
| make[2]: Leaving directory `/srv/home/pokybuild/yocto-autobuilder/yocto-slave/nightly-fsl-arm/build/build/tmp/work/armv7a-vfp-neon-poky-linux-gnueabi/avahi/0.6.31-r6.1/avahi-0.6.31/avahi-gobject'
| make[1]: *** [all-recursive] Error 1
| make[1]: Leaving directory `/srv/home/pokybuild/yocto-autobuilder/yocto-slave/nightly-fsl-arm/build/build/tmp/work/armv7a-vfp-neon-poky-linux-gnueabi/avahi/0.6.31-r6.1/avahi-0.6.31'
| make: *** [all] Error 2
| ERROR: oe_runmake failed
| ERROR: Function failed: do_compile (see /srv/home/pokybuild/yocto-autobuilder/yocto-slave/nightly-fsl-arm/build/build/tmp/work/armv7a-vfp-neon-poky-linux-gnueabi/avahi/0.6.31-r6.1/temp/log.do_compile.10241 for further information)
ERROR: Task 1668 (/srv/home/pokybuild/yocto-autobuilder/yocto-slave/nightly-fsl-arm/build/meta/recipes-connectivity/avahi/avahi_0.6.31.bb, do_compile) failed with exit code '1'
Summary: There were 2 ERROR
Comment 1 Richard Purdie 2013-02-06 23:52:25 UTC
This is a dup of 3667, same issue.

*** This bug has been marked as a duplicate of bug 3667 ***