Bug 4891 - gcc/gpp compile test fails occur during core-image-sato-sdk on nightly-ppc sanity testing
Summary: gcc/gpp compile test fails occur during core-image-sato-sdk on nightly-ppc sa...
Status: RESOLVED DUPLICATE of bug 4854
Alias: None
Product: Build Testing
Classification: QA/Testing
Component: general (show other bugs)
Version: unspecified
Hardware: x86 Multiple
: Undecided normal
Target Milestone: ---
Assignee: Alexandru Georgescu
QA Contact:
URL:
Whiteboard:
Depends on:
Blocks:
 
Reported: 2013-07-22 16:30 UTC by Beth Flanagan
Modified: 2013-07-22 20:14 UTC (History)
1 user (show)

See Also:
OS type for building Yocto: ---
Type of Regression: ---
Verified:
Documentation change: ---


Attachments

Note You need to log in before you can comment on or make changes to this bug.
Description Beth Flanagan 2013-07-22 16:30:33 UTC
From:
http://autobuilder.yoctoproject.org:8011/builders/nightly-ppc/builds/220/steps/Running%20Sanity%20Tests/logs/stdio

| ======================================================================
| FAIL: test_gcc_compile (oeqa.runtime.gcc.GccCompileTest)
| ----------------------------------------------------------------------
| Traceback (most recent call last):
|   File "/srv/home/pokybuild/yocto-autobuilder-new/yocto-slave/nightly-ppc/build/meta/lib/oeqa/runtime/gcc.py", line 22, in test_gcc_compile
|     self.assertEqual(status, 0, msg="running compiled file failed, output %s" % output)
| AssertionError: running compiled file failed, output convert: 10 => 10.000000
| floorf(1234.670000) = 1235.000000
| 
| ======================================================================
| FAIL: test_gpp_compile (oeqa.runtime.gcc.GccCompileTest)
| ----------------------------------------------------------------------
| Traceback (most recent call last):
|   File "/srv/home/pokybuild/yocto-autobuilder-new/yocto-slave/nightly-ppc/build/meta/lib/oeqa/runtime/gcc.py", line 28, in test_gpp_compile
|     self.assertEqual(status, 0, msg="running compiled file failed, output %s" % output)
| AssertionError: running compiled file failed, output convert: 10 => 10.000000
| floorf(1234.670000) = 1235.000000
| 
| ----------------------------------------------------------------------
| Ran 20 tests in 284.762s
| 
| FAILED (failures=2)
| DEBUG: Python function do_testimage finished
| ERROR: Function failed: Some tests failed. You should check the task log and the ssh log. (ssh log is /srv/home/pokybuild/yocto-autobuilder-new/yocto-slave/nightly-ppc/build/build/tmp/work/qemuppc-poky-linux/core-image-sato-sdk/1.0-r0/testimage/ssh_target_log.20130721180316
Comment 1 Saul Wold 2013-07-22 20:14:04 UTC
This is a dup of the floor() issue

*** This bug has been marked as a duplicate of bug 4854 ***