Bug 5509 - mips imagetest is failing for KernelModuleTest
Summary: mips imagetest is failing for KernelModuleTest
Status: RESOLVED FIXED
Alias: None
Product: OE-Core
Classification: Build System, Metadata & Runtime
Component: kernel (show other bugs)
Version: unspecified
Hardware: Other Multiple
: Undecided normal
Target Milestone: ---
Assignee: Nitin Kamble
QA Contact:
URL:
Whiteboard: autobuilder
Depends on:
Blocks:
 
Reported: 2013-11-07 20:08 UTC by Nitin Kamble
Modified: 2013-11-21 15:37 UTC (History)
3 users (show)

See Also:
OS type for building Yocto: ---
Type of Regression: ---
Verified:
Documentation change: No (bug/feature does not impact docs)


Attachments

Note You need to log in before you can comment on or make changes to this bug.
Description Nitin Kamble 2013-11-07 20:08:08 UTC
Link to the autobuilder log: 
  http://autobuilder.yoctoproject.org:8011/builders/nightly-mips/builds/354/steps/Running%20Sanity%20Tests/logs/stdio



Build Configuration:
BB_VERSION        = "1.21.0"
BUILD_SYS         = "x86_64-linux"
NATIVELSBSTRING   = "Fedora-19"
TARGET_SYS        = "mips-poky-linux"
MACHINE           = "qemumips"
DISTRO            = "poky"
DISTRO_VERSION    = "1.5+snapshot-20131106"
TUNE_FEATURES     = "o32 bigendian fpu-hard mips32"
TARGET_FPU        = ""
meta              
meta-yocto        
meta-yocto-bsp    = "master:d6cc7c8ed76c8b1117cf03c7bd4b0742f98f79b3"
meta-qt3          = "master:b73552fb998fd30a01dbee5a172e432a16078222

...

| test_kernel_module (oeqa.runtime.kernelmodule.KernelModuleTest) ... FAIL
| test_dmesg (oeqa.runtime.dmesg.DmesgTest) ... ok
| 
| ======================================================================
| FAIL: test_kernel_module (oeqa.runtime.kernelmodule.KernelModuleTest)
| ----------------------------------------------------------------------
| Traceback (most recent call last):
|   File "/home/pokybuild/yocto-autobuilder/yocto-slave/nightly-mips/build/meta/lib/oeqa/utils/decorators.py", line 48, in wrapped_f
|     return f(*args)
|   File "/home/pokybuild/yocto-autobuilder/yocto-slave/nightly-mips/build/meta/lib/oeqa/utils/decorators.py", line 48, in wrapped_f
|     return f(*args)
|   File "/home/pokybuild/yocto-autobuilder/yocto-slave/nightly-mips/build/meta/lib/oeqa/runtime/kernelmodule.py", line 30, in test_kernel_module
|     self.assertEqual(status, 0, msg="\n".join([cmd, output]))
| AssertionError: 255 != 0 : cd /usr/src/kernel && make scripts
|   HOSTCC  scripts/basic/fixdep
|   HOSTCC  scripts/kconfig/conf.o
|   SHIPPED scripts/kconfig/zconf.tab.c
|   SHIPPED scripts/kconfig/zconf.lex.c
|   SHIPPED scripts/kconfig/zconf.hash.c
|   HOSTCC  scripts/kconfig/zconf.tab.o
|   HOSTLD  scripts/kconfig/conf
| scripts/kconfig/conf --silentoldconfig Kconfig
|   CC      scripts/mod/empty.o
|   HOSTCC  scripts/mod/mk_elfconfig
|   MKELF   scripts/mod/elfconfig.h
|   CC      scripts/mod/devicetable-offsets.s
|   GEN     scripts/mod/devicetable-offsets.h
|   HOSTCC  scripts/mod/file2alias.o
|   HOSTCC  scripts/mod/modpost.o
|   HOSTCC  scripts/mod/sumversion.o
|   HOSTLD  scripts/mod/modpost
|   HOSTCC  scripts/kallsyms
| 
| [!!! SSH command timed out after 900 seconds and it was killed]
| 
| ----------------------------------------------------------------------
| Ran 46 tests in 3441.941s
| 
| FAILED (failures=1)
| NOTE: Sending SIGTERM to runqemu
| DEBUG: Python function do_testimage finished
| ERROR: Function failed: core-image-sato-sdk - FAILED - check the task log and the ssh log
NOTE: recipe core-image-sato-sdk-1.0-r0: task do_testimage: Failed
ERROR: Task 2 (/home/pokybuild/yocto-autobuilder/yocto-slave/nightly-mips/build/meta/recipes-sato/images/core-image-sato-sdk.bb, do_testimage) failed with exit code '1'
Comment 1 Richard Purdie 2013-11-14 15:53:35 UTC
Can we check if http://git.yoctoproject.org/cgit.cgi/poky/commit/?id=1e16634af63a49c3a59335e47d96691ff4df2a7a was in this build. If it was not this timeout issue is probably resolved after this commit.
Comment 2 Darren Hart 2013-11-14 15:55:01 UTC
Nitin, can you look up RP's question.
Comment 3 Nitin Kamble 2013-11-14 18:59:55 UTC
RP,
  FYI, the commit 1e16634af63a49c3a59335e47d96691ff4df2a7a was not in the poky at the time of this build failure.
Comment 4 Richard Purdie 2013-11-21 15:37:32 UTC
We're not seeing this in master and I think the commit referenced should stop this error appearing so closing as fixed by the commit referenced above.