Bug 6246 - dbus-test_1.6.18.bb, do_compile) failed
Summary: dbus-test_1.6.18.bb, do_compile) failed
Status: VERIFIED FIXED
Alias: None
Product: OE-Core
Classification: Build System, Metadata & Runtime
Component: core (show other bugs)
Version: 1.7
Hardware: All ppc
: Medium+ normal
Target Milestone: 1.7
Assignee: Chunrong Guo
QA Contact: Andra Necula
URL:
Whiteboard:
Depends on:
Blocks:
 
Reported: 2014-04-28 16:18 UTC by Nitin Kamble
Modified: 2014-08-29 08:15 UTC (History)
7 users (show)

See Also:
OS type for building Yocto: ---
Type of Regression: ---
Verified:
Documentation change: No (bug/feature does not impact docs)


Attachments

Note You need to log in before you can comment on or make changes to this bug.
Description Nitin Kamble 2014-04-28 16:18:03 UTC
Detailed log of last build step: http://autobuilder.yoctoproject.org/main/builders/nightly-fsl-ppc-lsb/builds/58/steps/BuildImages/logs/stdio

This is happening on multiple architectures.

| powerpc-poky-linux-gnuspe-libtool: link: powerpc-poky-linux-gnuspe-gcc -m32 -mcpu=8548 -mabi=spe -mspe -mfloat-gprs=double --sysroot=/home/pokybuild/yocto-autobuilder/yocto-slave/nightly-fsl-ppc-lsb/build/build/tmp/sysroots/p1022ds -Wall -Wextra -Wchar-subscripts -Wmissing-declarations -Wmissing-prototypes -Wnested-externs -Wpointer-arith -Wcast-align -Wno-address -Wfloat-equal -Wdeclaration-after-statement -Wno-missing-field-initializers -Wno-unused-paramet er -Wno- sign-compare -Wno-pointer-sign -Wno-type-limits -fno-common -fno-strict-aliasing -O2 -pipe -g -feliminate-unused-debug-types -fstack-protector-all -D_FORTIFY_SOURCE=2 -Wl,-O1 -Wl,--hash-style=gnu -Wl,--as-needed -Wl,-z -Wl,relro -Wl,-z -Wl,now -o dbus-test dbus-test-main.o -Wl,--export-dynamic ./.libs/libdbus-internal.a -lpthread -lrt
| ./.libs/libdbus-internal.a(libdbus_internal_la-dbus-hash.o):(.debug_loc+0x188c): undefined reference to `.LCL26'
| ./.libs/libdbus-internal.a(libdbus_internal_la-dbus-hash.o):(.debug_loc+0x18ab): undefined reference to `.LCL26'
| collect2: error: ld returned 1 exit status
| Makefile:995: recipe for target 'dbus-test' failed
| make[3]: *** [dbus-test] Error 1
| make[3]: Leaving directory '/home/pokybuild/yocto-autobuilder/yocto-slave/nightly-fsl-ppc-lsb/build/build/tmp/work/ppce500v2-poky-linux-gnuspe/dbus-test/1.6.18-r0/build/dbus'
| Makefile:894: recipe for target 'all' failed
| make[2]: *** [all] Error 2
| make[2 ]: Leavi ng directory '/home/pokybuild/yocto-autobuilder/yocto-slave/nightly-fsl-ppc-lsb/build/build/tmp/work/ppce500v2-poky-linux-gnuspe/dbus-test/1.6.18-r0/build/dbus'
| Makefile:647: recipe for target 'all-recursive' failed
| make[1]: *** [all-recursive] Error 1
| make[1]: Leaving directory '/home/pokybuild/yocto-autobuilder/yocto-slave/nightly-fsl-ppc-lsb/build/build/tmp/work/ppce500v2-poky-linux-gnuspe/dbus-test/1.6.18-r0/build'
| Makefile:516: recipe for target 'all' failed
| make: *** [all] Error 2
| ERROR: oe_runmake failed
| WARNING: /home/pokybuild/yocto-autobuilder/yocto-slave/nightly-fsl-ppc-lsb/build/build/tmp/work/ppce500v2-poky-linux-gnuspe/dbus-test/1.6.18-r0/temp/run.do_compile.25152:1 exit 1 from
| exit 1
| ERROR: Function failed: do_compile (log file is located at /home/pokybuild/yocto-autobuilder/yocto-slave/nightly-fsl-ppc-lsb/build/build/tmp/work/ppce500v2-poky-linux-gnuspe/dbus-test/1.6.18-r0/temp/log.do_compile.25152)
ERROR: Tas k 5275 ( /home/pokybuild/yocto-autobuilder/yocto-slave/nightly-fsl-ppc-lsb/build/meta/recipes-core/dbus/dbus-test_1.6.18.bb, do_compile) failed with exit code '1'
Summary: There was 1 ERROR message shown, returning a non-zero exit code.
Comment 1 Zhenhua Luo 2014-05-09 08:47:43 UTC
I tried several times to build dbus-test, all passed. I can't reproduce the build issue.

Is this issue still exists? I see latest report of nightly-fsl-ppc-lsb passed.
https://autobuilder.yoctoproject.org/main/builders/nightly-fsl-ppc-lsb/builds/82/steps/BuildImages/logs/stdio
Comment 2 Zhenhua Luo 2014-05-09 08:59:40 UTC
If the issue persists, please provide the detailed reproduce steps.
Comment 3 Zhenhua Luo 2014-05-11 03:41:37 UTC
The issue can't be reproduced.
Comment 4 Zhenhua Luo 2014-05-11 03:42:43 UTC
The issue can't be reproduced, please reopen if the issue appears and provide the reproduce steps.
Comment 5 Andra Necula 2014-08-29 08:15:12 UTC
Verified on
poky 2d1660112e54653f7bb763939d0416472c49fe01
Ubuntu 14.04, x86_64
Cheers! Andra