Bug 6416 - qemuppc: neard recipe compile fails with: fatal error: near/dbus.h: No such file or directory
Summary: qemuppc: neard recipe compile fails with: fatal error: near/dbus.h: No such f...
Status: RESOLVED FIXED
Alias: None
Product: OE-Core
Classification: Build System, Metadata & Runtime
Component: core (show other bugs)
Version: 1.7
Hardware: Other ppc
: Medium normal
Target Milestone: 1.7
Assignee: Ross Burton
QA Contact:
URL:
Whiteboard:
Depends on:
Blocks:
 
Reported: 2014-06-06 23:15 UTC by Nitin Kamble
Modified: 2014-06-17 16:28 UTC (History)
2 users (show)

See Also:
OS type for building Yocto: ---
Type of Regression: ---
Verified:
Documentation change: No (bug/feature does not impact docs)


Attachments

Note You need to log in before you can comment on or make changes to this bug.
Description Nitin Kamble 2014-06-06 23:15:22 UTC
| powerpc-poky-li nux-gcc -m32 -mhard-float -mcpu=e300c3 --sysroot=/home/pokybuild/yocto-autobuilder/yocto-slave/nightly-ppc/build/build/tmp/sysroots/mpc8315e-rdb -DHAVE_CONFIG_H -I. -I./include -I./src -I./gdbus -I/home/pokybuild/yocto-autobuilder/yocto-slave/nightly-ppc/build/build/tmp/sysroots/mpc8315e-rdb/usr/include/glib-2.0 -I/home/pokybuild/yocto-autobuilder/yocto-slave/nightly-ppc/build/build/tmp/sysroots/mpc8315e-rdb/usr/lib/glib-2.0/include -I/home/pokybuild/yocto-autobuilder/yocto-slave/nightly-ppc/build/build/tmp/sysroots/mpc8315e-rdb/usr/include/dbus-1.0 -I/home/pokybuild/yocto-autobuilder/yocto-slave/nightly-ppc/build/build/tmp/sysroots/mpc8315e-rdb/usr/lib/dbus-1.0/include -I/home/pokybuild/yocto-autobuilder/yocto-slave/nightly-ppc/build/build/tmp/sysroots/mpc8315e-rdb/usr/include/libnl3 -DNEAR_PLUGIN_BUILTIN -DPLUGINDIR=\""/usr/lib/near/plugins"\" -DCONFIGDIR=\""/etc/neard\"" -O2 -pipe -g -feliminate-unused-debug-types -c -o unit/test-utils.o unit/test-utils.c
| In file incl uded fro m unit/test-ndef-build.c:33:0:
| ./src/near.h:41:23: fatal error: near/dbus.h: No such file or directory
| #include 
| ^
| compilation terminated.
...
| ERROR: oe_runmake failed
| WARNING: /home/pokybuild/yocto-autobuilder/yocto-slave/nightly-ppc/build/build/tmp/work/ppce300c3-poky-linux/neard/0.14-r0/temp/run.do_compile.6939:1 exit 1 from
| exit 1
| ERROR: Function failed: do_compile (log file is located at /home/pokybuild/yocto-autobuilder/yocto-slave/nightly-ppc/build/build/tmp/work/ppce300c3-poky-linux/neard/0.14-r0/temp/log.do_compile.6939)


Further log is here:
http://autobuilder.yoctoproject.org/main/builders/nightly-ppc/builds/126/steps/BuildImages_1/logs/stdio
Comment 1 Ross Burton 2014-06-17 16:28:54 UTC
Fixed in 4625eb0793ff59e4414017df0371ee9b89f47b38.