Bug 8270 - systemd testing fails date test
Summary: systemd testing fails date test
Status: VERIFIED FIXED
Alias: None
Product: Runtime Testing
Classification: QA/Testing
Component: general (show other bugs)
Version: unspecified
Hardware: x86 Multiple
: Medium+ normal
Target Milestone: 1.9 M3
Assignee: Ross Burton
QA Contact: Bogdan Alexandru Voiculescu
URL:
Whiteboard:
Depends on:
Blocks:
 
Reported: 2015-09-08 16:37 UTC by Beth Flanagan
Modified: 2015-10-08 07:48 UTC (History)
3 users (show)

See Also:
OS type for building Yocto: ---
Type of Regression: ---
Verified:
Documentation change: No (bug/feature does not impact docs)


Attachments

Note You need to log in before you can comment on or make changes to this bug.
Description Beth Flanagan 2015-09-08 16:37:59 UTC
https://autobuilder.yoctoproject.org/main/builders/nightly-qa-systemd/builds/480/steps/Running%20Sanity%20Tests/logs/stdio

| ======================================================================
| FAIL: test_date (oeqa.runtime.date.DateTest)
| ----------------------------------------------------------------------
| Traceback (most recent call last):
|   File "/home/pokybuild/yocto-autobuilder/yocto-worker/nightly-qa-systemd/build/meta/lib/oeqa/utils/decorators.py", line 102, in wrapped_f
|     return func(*args)
|   File "/home/pokybuild/yocto-autobuilder/yocto-worker/nightly-qa-systemd/build/meta/lib/oeqa/utils/decorators.py", line 90, in wrapped_f
|     return f(*args)
|   File "/home/pokybuild/yocto-autobuilder/yocto-worker/nightly-qa-systemd/build/meta/lib/oeqa/runtime/date.py", line 20, in test_date
|     self.assertTrue(p, msg="The date was not set correctly, output: %s" % output)
| AssertionError: None is not true : The date was not set correctly, output: Mon, 07 Sep 2015 16:55:39 +0000
| 
| ----------------------------------------------------------------------
| Ran 53 tests in 894.738s
| 
| FAILED (failures=1, skipped=1)
Comment 1 Richard Purdie 2015-09-09 13:09:11 UTC
This only happens with the systemd upgrade in master-next from Khem
Comment 2 Ross Burton 2015-09-10 14:42:52 UTC
Fix for the test case sent.
Comment 3 Ross Burton 2015-09-21 12:55:45 UTC
Fixed in oe-core 5334f1b1e9363fa9c128289b51ade55c7ae1a0a3.
Comment 4 Bogdan Alexandru Voiculescu 2015-10-08 07:48:25 UTC
Verified: https://autobuilder.yoctoproject.org/main/builders/nightly-qa-systemd/builds/505/steps/Running%20Sanity%20Tests/logs/stdio

meta-yocto-bsp    = "master-next:f561c6aaedf74c305e769d66ce088ade565b2196"