Bug 8285 - xf86-video-omapfb patch fails to apply during world build
Summary: xf86-video-omapfb patch fails to apply during world build
Status: RESOLVED INVALID
Alias: None
Product: OE-Core
Classification: Build System, Metadata & Runtime
Component: core (show other bugs)
Version: 1.7.3
Hardware: x86 Multiple
: Undecided normal
Target Milestone: ---
Assignee: Ross Burton
QA Contact:
URL:
Whiteboard:
Depends on:
Blocks:
 
Reported: 2015-09-11 11:59 UTC by Beth Flanagan
Modified: 2015-09-12 22:10 UTC (History)
3 users (show)

See Also:
OS type for building Yocto: ---
Type of Regression: ---
Verified:
Documentation change: No (bug/feature does not impact docs)


Attachments

Note You need to log in before you can comment on or make changes to this bug.
Description Beth Flanagan 2015-09-11 11:59:23 UTC
Seen: https://autobuilder.yoctoproject.org/main/builders/nightly-world/builds/491/steps/BuildImages/logs/stdio

NOTE: Running noexec task 5056 of 21720 (ID: 12508, virtual:multilib:lib32:/home/pokybuild/yocto-autobuilder/yocto-worker/nightly-world/build/meta/recipes-qt/packagegroups/packagegroup-qt-toolchain-target.bb, do_patch)
NOTE: Running task 5057 of 21720 (ID: 12433, virtual:multilib:lib32:/home/pokybuild/yocto-autobuilder/yocto-worker/nightly-world/build/meta/recipes-graphics/xorg-driver/xf86-video-omapfb_git.bb, do_patch)
ERROR: Command Error: exit status: 1  Output:
Applying patch 0001-BaseTools-Force-tools-variables-to-host-toolchain.patch
patching file BaseTools/Source/C/Makefiles/app.makefile
Hunk #1 FAILED at 16 (different line endings).
1 out of 1 hunk FAILED -- rejects in file BaseTools/Source/C/Makefiles/app.makefile
patching file BaseTools/Source/C/VfrCompile/GNUmakefile
Hunk #1 FAILED at 26 (different line endings).
1 out of 1 hunk FAILED -- rejects in file BaseTools/Source/C/VfrCompile/GNUmakefile
Patch 0001-BaseTools-Force-tools-variables-to-host-toolchain.patch does not apply (enforce with -f)
ERROR: Function failed: patch_do_patch
ERROR: Logfile of failure stored in: /home/pokybuild/yocto-autobuilder/yocto-worker/nightly-world/build/build/tmp/work/x86-pokymllib32-linux/lib32-ovmf/git-r0/temp/log.do_patch.6467
NOTE: recipe lib32-ovmf-git-r0: task do_patch: Failed
NOTE: recipe lib32-build-compare-git-r0: task do_patch: Succeeded
ERROR: Task 12901 (virtual:multilib:lib32:/home/pokybuild/yocto-autobuilder/yocto-worker/nightly-world/build/meta/recipes-core/ovmf/ovmf_git.bb, do_patch) failed with exit code '1'
NOTE: Running task 5058 of 21720 (ID: 12388, virtual:multilib:lib32:/home/pokybuild/yocto-autobuilder/yocto-worker/nightly-world/build/meta/recipes-devtools/mmc/mmc-utils_git.bb, do_patch)
Comment 1 Richard Purdie 2015-09-12 22:10:52 UTC
ovfm dropped from -next, reported issue against path on mailing list.