Created attachment 2940 [details] Bulild log Using revision dd0ba9ea4a11ab15348d4fe3574e4b28784db82f do_compile failed for util-linux. The build log as well as the createautoconf log are attached. | /home/pokybuild/yocto-autobuilder/yocto-worker/nightly-uclibc/build/build/tmp/work/i586-poky-linux-uclibc/util-linux/2.26.2-r0/util-linux-2.26.2/login-utils/utmpdump.c:31:18: fatal error: utmp.h: No such file or directory | compilation terminated. | /home/pokybuild/yocto-autobuilder/yocto-worker/nightly-uclibc/build/build/tmp/work/i586-poky-linux-uclibc/util-linux/2.26.2-r0/util-linux-2.26.2/login-utils/last.c:33:18: fatal error: utmp.h: No such file or directory | compilation terminated. | /home/pokybuild/yocto-autobuilder/yocto-worker/nightly-uclibc/build/build/tmp/work/i586-poky-linux-uclibc/util-linux/2.26.2-r0/util-linux-2.26.2/term-utils/wall.c:59:18: fatal error: utmp.h: No such file or directory | compilation terminated. | make[2]: *** [login-utils/utmpdump.o] Error 1 | make[2]: *** Waiting for unfinished jobs.... | make[2]: *** [login-utils/last.o] Error 1 | make[2]: *** [term-utils/wall-wall.o] Error 1 | /home/pokybuild/yocto-autobuilder/yocto-worker/nightly-uclibc/build/build/tmp/work/i586-poky-linux-uclibc/util-linux/2.26.2-r0/util-linux-2.26.2/term-utils/write.c:50:18: fatal error: utmp.h: No such file or directory | compilation terminated. | make[2]: *** [term-utils/write-write.o] Error 1 | make[2]: Leaving directory `/home/pokybuild/yocto-autobuilder/yocto-worker/nightly-uclibc/build/build/tmp/work/i586-poky-linux-uclibc/util-linux/2.26.2-r0/build' | make[1]: *** [all-recursive] Error 1 | make[1]: Leaving directory `/home/pokybuild/yocto-autobuilder/yocto-worker/nightly-uclibc/build/build/tmp/work/i586-poky-linux-uclibc/util-linux/2.26.2-r0/build' | make: *** [all] Error 2 | ERROR: oe_runmake failed | ERROR: Function failed: do_compile (log file is located at /home/pokybuild/yocto-autobuilder/yocto-worker/nightly-uclibc/build/build/tmp/work/i586-poky-linux-uclibc/util-linux/2.26.2-r0/temp/log.do_compile.26174) NOTE: recipe util-linux-2.26.2-r0: task do_compile: Failed
Created attachment 2941 [details] CreateAutoConf log
Right, confirmed that this is fixed in master with 969158d63ba2c8e2e11af41c2a6d4f1aa5b0099f.
Patch sent for jethro.
Fixed in jethro in oe-core 05cab660ea956aabf6e6f971bdc5c9e2d94b9f2d.
Used latest commit from jethro : 5b12268f6e17574999f91628a60e21711cf62ee4 and successfully built util-linux. Marking as verified