Bug 957 - autobuilder build failed for mpc8315e-rdb minimal,sato,sato-sdk,lsb in nightly build (20110404-1)
Summary: autobuilder build failed for mpc8315e-rdb minimal,sato,sato-sdk,lsb in nightl...
Status: VERIFIED FIXED
Alias: None
Product: Meta-yocto
Classification: Build System, Metadata & Runtime
Component: meta-yocto (show other bugs)
Version: unspecified
Hardware: mpc8315e-rdb ppc
: Medium normal
Target Milestone: 1.1
Assignee: Saul Wold
QA Contact:
URL:
Whiteboard:
Depends on:
Blocks:
 
Reported: 2011-04-06 19:17 UTC by liang li
Modified: 2011-05-16 04:10 UTC (History)
7 users (show)

See Also:
OS type for building Yocto: ---
Type of Regression: ---
Verified:
Documentation change: ---


Attachments

Note You need to log in before you can comment on or make changes to this bug.
Description liang li 2011-04-06 19:17:26 UTC
no rootfs files found in nightly build 20110404-1:
http://autobuilder.pokylinux.org/nightly/20110404-1/machines/mpc8315e-rdb/ppc/

git info :
commit f897723207b00b4c9dcdb43107891b7b82ce22f3
Comment 1 liang li 2011-04-07 01:16:43 UTC
from autobuilder logs ,the error found below:

poky-autobuild poky-image-sato poky-image-sato-sdk poky-image-minimal poky-image-minimal-sdk -k
 in dir /srv/home/pokybuild/poky-slave/nightly-external/build (timeout 14400 secs)
......
OE Build Configuration:
BB_VERSION        = "1.11.0"
METADATA_BRANCH   = "master"
METADATA_REVISION = "f897723207b00b4c9dcdb43107891b7b82ce22f3"
TARGET_ARCH       = "powerpc"
TARGET_OS         = "linux"
MACHINE           = "mpc8315e-rdb"
DISTRO            = "poky"
DISTRO_VERSION    = "1.0+snapshot-20110405"
TARGET_FPU        = "spe"
....

NOTE: Running task 6713 of 6760 (ID: 8, /srv/home/pokybuild/poky-slave/nightly-external/build/meta/recipes-sato/images/poky-image-sato.bb, do_rootfs)
NOTE: package libzypp-0.0-git1+15b6c52260bbc52b3d8e585e271b67e10cc7c433-r9: task do_rm_work: Started
NOTE: package boost-1.44.0-r0: task do_rm_work: Started
NOTE: package poky-image-sato-1.0-r0: task do_rootfs: Started
NOTE: package zypper-1.5.3-git1+2c5bb6ceb99ecd950ef993e43d77bf0569ea0582-r5: task do_rm_work: Started
NOTE: package zypper-1.5.3-git1+2c5bb6ceb99ecd950ef993e43d77bf0569ea0582-r5: task do_rm_work: Succeeded
NOTE: package libzypp-0.0-git1+15b6c52260bbc52b3d8e585e271b67e10cc7c433-r9: task do_rm_work: Succeeded
NOTE: package boost-1.44.0-r0: task do_rm_work: Succeeded
ERROR: Function 'do_rootfs' failed (see /srv/home/pokybuild/poky-slave/nightly-external/build/build/tmp/work/mpc8315e_rdb-poky-linux/poky-image-sato-1.0-r0/temp/log.do_rootfs.31128 for further information)
ERROR: Logfile of failure stored in: /srv/home/pokybuild/poky-slave/nightly-external/build/build/tmp/work/mpc8315e_rdb-poky-linux/poky-image-sato-1.0-r0/temp/log.do_rootfs.31128
Log data follows:
| Generating solve db for /srv/home/pokybuild/poky-slave/nightly-external/build/build/tmp/deploy/rpm/mpc8315e_rdb...
|    total:               1      0.000000 MB      1.137083 secs
|    fingerprint:      1095      0.006986 MB      0.297096 secs
|    install:           365      0.000000 MB      0.524172 secs
|    dbadd:             365      0.000000 MB      0.512507 secs
|    dbget:            2175      0.000000 MB      0.004443 secs
|    dbput:             365      1.633548 MB      0.430453 secs
|    readhdr:          3651      3.187040 MB      0.007251 secs
|    hdrload:          1825      4.738732 MB      0.008918 secs
|    hdrget:          62571      0.000000 MB      0.049918 secs
| Generating solve db for /srv/home/pokybuild/poky-slave/nightly-external/build/build/tmp/deploy/rpm/ppc603e...
|    total:               1      0.000000 MB     35.786916 secs
|    fingerprint:     17706      0.203582 MB      1.596485 secs
|    install:          5902      0.000000 MB     14.196484 secs
|    dbadd:            5902      0.000000 MB     13.906287 secs
|    dbget:           64228      0.000000 MB      0.193513 secs
|    dbput:            5902     27.552248 MB     12.492604 secs
|    readhdr:         59021     54.534850 MB      0.189832 secs
|    hdrload:         30864     86.869302 MB      0.214860 secs
|    hdrget:        1063344      0.000000 MB      1.346342 secs
| Generating solve db for /srv/home/pokybuild/poky-slave/nightly-external/build/build/tmp/deploy/rpm/all...
|    total:               1      0.000000 MB      0.233086 secs
|    fingerprint:       117      0.003364 MB      0.009876 secs
|    install:            39      0.000000 MB      0.119869 secs
|    dbadd:              39      0.000000 MB      0.112560 secs
|    dbget:             632      0.000000 MB      0.001543 secs
|    dbput:              39      0.259584 MB      0.061307 secs
|    readhdr:           391      0.514992 MB      0.001294 secs
|    hdrload:           195      0.765744 MB      0.001263 secs
|    hdrget:           6445      0.000000 MB      0.008563 secs
| Generating solve db for /srv/home/pokybuild/poky-slave/nightly-external/build/build/tmp/deploy/rpm/all...
| Processing locale-base-en-us...
| Processing locale-base-en-gb...
| Processing task-poky-boot...
| Processing task-base-extended...
| Processing task-poky-apps-console...
| Processing task-poky-x11-base...
| Processing task-poky-x11-sato...
| Processing task-poky-apps-x11-core...
| Processing task-poky-apps-x11-games...
| Processing task-poky-apps-x11-pimlico...
| Processing task-poky-tools-debug...
| Processing task-poky-tools-profile...
| Processing task-poky-tools-testapps...
| Processing task-poky-ssh-dropbear...
| Processing rpm...
| Processing zypper...
| error: Failed dependencies:
| 	keymaps is needed by task-poky-boot-1.0-r7.mpc8315e_rdb
| 	keymaps is needed by task-base-keyboard-1.0-r70.mpc8315e_rdb
| error: LOOP:
| error: removing busybox-1.17.3-r2.ppc603e "Requires(hint): busybox-udhcpc" from tsort relations.
| error: removing busybox-udhcpc-1.17.3-r2.ppc603e "Requires(post): /bin/sh" from tsort relations.
| error: LOOP:
| error: removing augeas-0.7.4-r0.ppc603e "Requires: libaugeas0 >= 0.7.4" from tsort relations.
| error: removing libaugeas0-0.7.4-r0.ppc603e "Requires(hint): augeas" from tsort relations.
| error: LOOP:
| error: removing busybox-1.17.3-r2.ppc603e "Requires(hint): busybox-syslog" from tsort relations.
| error: removing busybox-syslog-1.17.3-r2.ppc603e "Requires(post): /bin/sh" from tsort relations.
| error: LOOP:
| error: removing libudev0-164-r1.ppc603e "Requires: udev = 164-r1" from tsort relations.
| error: removing udev-164-r1.ppc603e "Requires: libudev0 >= 164" from tsort relations.
| error: LOOP:
| error: removing libdbus-1-3-1.4.1-r1.ppc603e "Requires(hint): dbus-1" from tsort relations.
| error: removing dbus-1-1.4.1-r1.ppc603e "Requires: libdbus-1-3 >= 1.4.1" from tsort relations.
| error: LOOP:
| error: removing libecal-1.2-7-2.30+git1+7337d11aed576e7caaa12b4e881ad8d33668799f-r1.ppc603e "Requires(hint): libedata-cal-1.2-7" from tsort relations.
| error: removing libedata-cal-1.2-7-2.30+git1+7337d11aed576e7caaa12b4e881ad8d33668799f-r1.ppc603e "Requires: libecal-1.2-7 >= 2.30+git1+7337ERROR: Function 'do_rootfs' failed (see /srv/home/pokybuild/poky-slave/nightly-external/build/build/tmp/work/mpc8315e_rdb-poky-linux/poky-image-sato-1.0-r0/temp/log.do_rootfs.31128 for further information)
| d11aed576e7caaa12b4e881ad8d33668799f" from tsort relations.
| error: LOOP:
| error: removing libebook-1.2-9-2.30+git1+7337d11aed576e7caaa12b4e881ad8d33668799f-r1.ppc603e "Requires(hint): libedata-book-1.2-2" from tsort relations.
| error: removing libedata-book-1.2-2-2.30+git1+7337d11aed576e7caaa12b4e881ad8d33668799f-r1.ppc603e "Requires: libebook-1.2-9 >= 2.30+git1+7337d11aed576e7caaa12b4e881ad8d33668799f" from tsort relations.
| error: LOOP:
| error: removing gnome-vfs-2.24.4-r0.ppc603e "Requires(hint): gnome-vfs-plugin-file" from tsort relations.
| error: removing gnome-vfs-plugin-file-2.24.4-r0.ppc603e "Requires: gnome-vfs >= 2.24.4" from tsort relations.
NOTE: package poky-image-sato-1.0-r0: task do_rootfs: Failed
ERROR: Task 8 (/srv/home/pokybuild/poky-slave/nightly-external/build/meta/recipes-sato/images/poky-image-sato.bb, do_rootfs) failed with exit code '1'
.......
NOTE: Running task 6749 of 6760 (ID: 25, /srv/home/pokybuild/poky-slave/nightly-external/build/meta/recipes-sato/images/poky-image-sato-sdk.bb, do_rootfs)
NOTE: Running noexec task 6750 of 6760 (ID: 357, /srv/home/pokybuild/poky-slave/nightly-external/build/meta/recipes-qt/tasks/task-poky-qt.bb, do_build)
NOTE: Running task 6751 of 6760 (ID: 362, /srv/home/pokybuild/poky-slave/nightly-external/build/meta/recipes-qt/tasks/task-poky-qt.bb, do_rm_work)
NOTE: package quicky-0.4-r1: task do_rm_work: Started
NOTE: package task-poky-qt-1.0-r3: task do_rm_work: Started
NOTE: package qt4-x11-free-4.7.1-r21.1: task do_rm_work: Started
NOTE: package quicky-0.4-r1: task do_rm_work: Succeeded
NOTE: package poky-image-sato-sdk-1.0-r0: task do_rootfs: Started
NOTE: package fotowall-0.9-r1: task do_rm_work: Started
NOTE: package task-poky-qt-1.0-r3: task do_rm_work: Succeeded
NOTE: package fotowall-0.9-r1: task do_rm_work: Succeeded
NOTE: package qt4-x11-free-4.7.1-r21.1: task do_rm_work: Succeeded
ERROR: Function 'do_rootfs' failed (see /srv/home/pokybuild/poky-slave/nightly-external/build/build/tmp/work/mpc8315e_rdb-poky-linux/poky-image-sato-sdk-1.0-r0/temp/log.do_rootfs.23742 for further information)
ERROR: Logfile of failure stored in: /srv/home/pokybuild/poky-slave/nightly-external/build/build/tmp/work/mpc8315e_rdb-poky-linux/poky-image-sato-sdk-1.0-r0/temp/log.do_rootfs.23742
Log data follows:
| Generating solve db for /srv/home/pokybuild/poky-slave/nightly-external/build/build/tmp/deploy/rpm/mpc8315e_rdb...
|    total:               1      0.000000 MB      5.281011 secs
|    fingerprint:      1095      0.006986 MB      0.338852 secs
|    install:           365      0.000000 MB      0.781015 secs
|    dbadd:             365      0.000000 MB      0.763139 secs
|    dbget:            2175      0.000000 MB      0.007115 secs
|    dbput:             365      1.633548 MB      0.636213 secs
|    readhdr:          3651      3.187040 MB      3.500209 secs
|    hdrload:          1825      4.738732 MB      0.015129 secs
|    hdrget:          62571      0.000000 MB      0.092320 secs
| Generating solve db for /srv/home/pokybuild/poky-slave/nightly-external/build/build/tmp/deploy/rpm/ppc603e...
|    total:               1      0.000000 MB     81.701905 secs
|    fingerprint:     18042      0.239288 MB      2.325044 secs
|    install:          6014      0.000000 MB      8.235289 secs
|    dbadd:            6014      0.000000 MB      8.104366 secs
|    dbget:           77349      0.000000 MB      0.147131 secs
|    dbput:            6014     29.776832 MB      7.297659 secs
|    readhdr:         60141     58.941514 MB     51.643489 secs
|    hdrload:         31439     93.525998 MB      0.173089 secs
|    hdrget:        1083632      0.000000 MB      1.096306 secs
| Generating solve db for /srv/home/pokybuild/poky-slave/nightly-external/build/build/tmp/deploy/rpm/all...
|    total:               1      0.000000 MB      0.533137 secs
|    fingerprint:       117      0.003364 MB      0.028556 secs
|    install:            39      0.000000 MB      0.125421 secs
|    dbadd:              39      0.000000 MB      0.118706 secs
|    dbget:             632      0.000000 MB      0.001322 secs
|    dbput:              39      0.259584 MB      0.066500 secs
|    readhdr:           391      0.514992 MB      0.265109 secs
|    hdrload:           195      0.765744 MB      0.001558 secs
|    hdrget:           6445      0.000000 MB      0.008614 secs
| Generating solve db for /srv/home/pokybuild/poky-slave/nightly-external/build/build/tmp/deploy/rpm/all...
| Processing locale-base-en-us...
| Processing locale-base-en-gb...
| Processing task-poky-boot...
| Processing task-base-extended...
| Processing task-poky-boot-dev...
| Processing task-base-dev...
| Processing task-poky-apps-console...
| Processing task-poky-apps-console-dev...
| Processing task-poky-x11-base...
| Processing task-poky-x11-base-dev...
| Processing task-poky-x11-sato...
| Processing task-poky-x11-sato-dev...
| Processing task-poky-apps-x11-core...
| Processing task-poky-apps-x11-core-dev...
| Processing task-poky-apps-x11-games...
| Processing task-poky-apps-x11-games-dev...
| Processing task-poky-apps-x11-pimlico...
| Processing task-poky-apps-x11-pimlico-dev...
| Processing task-poky-tools-debug...
| Processing task-poky-tools-debug-dev...
| Processing task-poky-tools-profile...
| Processing task-poky-tools-profile-dev...
| Processing task-poky-tools-testapps...
| Processing task-poky-tools-testapps-dev...
| Processing task-poky-sdk...
| Processing task-poky-standalone-sdk-target...
| Processing task-poky-sdk-dev...
| Processing task-poky-ssh-dropbear...
| Processing task-poky-ssh-dropbear-dev...
| Processing rpm...
| Processing zypper...
| Processing task-poky-qt-demos...
| error: Failed dependencies:
| 	keymaps is needed by task-poky-boot-1.0-r7.mpc8315e_rdb
| 	keymaps is needed by task-base-keyboard-1.0-r70.mpc8315e_rdb
| error: LOOP:
| error: removing busybox-1.17.3-r2.ppc603e "Requires(hint): busybox-udhcpc" from tsort relations.
| error: removing busybox-udhcpc-1.17.3-r2.ppc603e "Requires(post): /bin/sh" from tsort relations.
| error: LOOP:
| error: removing augeas-0.7.4-r0.ppc603e "Requires: libaugeas0 >= 0.7.4" from tsort relations.
| error: removing libaugeas0-0.7.4-r0.ppc603e "Requires(hint): augeas" from tsort relations.
| error: LOOP:
| error: removing busybox-1.17.3-r2.ppc603e "Requires(hint): busybox-syslog" from tsort relations.
| error: removing busybox-syslog-1.17.3-r2.ppc603e "Requires(post): /bin/sh" from tsort relations.
| error: LOOP:
| error: removing libudev0-164-r1.ppc603e "Requires: udev = 164-r1" ERROR: Function 'do_rootfs' failed (see /srv/home/pokybuild/poky-slave/nightly-external/build/build/tmp/work/mpc8315e_rdb-poky-linux/poky-image-sato-sdk-1.0-r0/temp/log.do_rootfs.23742 for further information)
| from tsort relations.
| error: removing udev-164-r1.ppc603e "Requires: libudev0 >= 164" from tsort relations.
| error: LOOP:
| error: removing libdbus-1-3-1.4.1-r1.ppc603e "Requires(hint): dbus-1" from tsort relations.
| error: removing dbus-1-1.4.1-r1.ppc603e "Requires: libdbus-1-3 >= 1.4.1" from tsort relations.
| error: LOOP:
| error: removing udev-dev-164-r1.ppc603e "Requires(hint): libudev-dev" from tsort relations.
| error: removing libudev-dev-164-r1.ppc603e "Requires(hint): udev-dev" from tsort relations.
| error: LOOP:
| error: removing gnome-vfs-2.24.4-r0.ppc603e "Requires(hint): gnome-vfs-plugin-file" from tsort relations.
| error: removing gnome-vfs-plugin-file-2.24.4-r0.ppc603e "Requires: gnome-vfs >= 2.24.4" from tsort relations.
| error: LOOP:
| error: removing libecal-1.2-7-2.30+git1+7337d11aed576e7caaa12b4e881ad8d33668799f-r1.ppc603e "Requires(hint): libedata-cal-1.2-7" from tsort relations.
| error: removing libedata-cal-1.2-7-2.30+git1+7337d11aed576e7caaa12b4e881ad8d33668799f-r1.ppc603e "Requires: libecal-1.2-7 >= 2.30+git1+7337d11aed576e7caaa12b4e881ad8d33668799f" from tsort relations.
| error: LOOP:
| error: removing libebook-1.2-9-2.30+git1+7337d11aed576e7caaa12b4e881ad8d33668799f-r1.ppc603e "Requires(hint): libedata-book-1.2-2" from tsort relations.
| error: removing libedata-book-1.2-2-2.30+git1+7337d11aed576e7caaa12b4e881ad8d33668799f-r1.ppc603e "Requires: libebook-1.2-9 >= 2.30+git1+7337d11aed576e7caaa12b4e881ad8d33668799f" from tsort relations.
| error: LOOP:
| error: removing libebook-1.2-dev-2.30+git1+7337d11aed576e7caaa12b4e881ad8d33668799f-r1.ppc603e "Requires(hint): libcamel-dev" from tsort relations.
| error: removing libcamel-dev-2.30+git1+7337d11aed576e7caaa12b4e881ad8d33668799f-r1.ppc603e "Requires(hint): eds-dbus-dev" from tsort relations.
| error: removing eds-dbus-dev-2.30+git1+7337d11aed576e7caaa12b4e881ad8d33668799f-r1.ppc603e "Requires(hint): libebook-1.2-dev" from tsort relations.
NOTE: package poky-image-sato-sdk-1.0-r0: task do_rootfs: Failed
ERROR: Task 25 (/srv/home/pokybuild/poky-slave/nightly-external/build/meta/recipes-sato/images/poky-image-sato-sdk.bb, do_rootfs) failed with exit code '1'
ERROR: '/srv/home/pokybuild/poky-slave/nightly-external/build/meta/recipes-core/images/poky-image-minimal.bb' failed
ERROR: '/srv/home/pokybuild/poky-slave/nightly-external/build/meta/recipes-sato/images/poky-image-sato.bb' failed
ERROR: '/srv/home/pokybuild/poky-slave/nightly-external/build/meta/recipes-sato/images/poky-image-sato-sdk.bb' failed
program finished with exit code 1
Comment 2 liang li 2011-04-07 01:24:33 UTC
for lsb-sdk , error below :
...

NOTE: Running task 3597 of 7190 (ID: 1920, /srv/home/pokybuild/poky-slave/nightly-external-lsb/build/meta/recipes-core/gettext/gettext_0.17.bb, do_install)
ERROR: Function 'do_compile' failed (see /srv/home/pokybuild/poky-slave/nightly-external-lsb/build/build/tmp/work/ppc603e-poky-linux/slang-2.2.2-r2/temp/log.do_compile.13834 for further information)
ERROR: Logfile of failure stored in: /srv/home/pokybuild/poky-slave/nightly-external-lsb/build/build/tmp/work/ppc603e-poky-linux/slang-2.2.2-r2/temp/log.do_compile.13834
Log data follows:
| NOTE: make -j 16
| cd src; make elf
| make[1]: Entering directory `/srv/home/pokybuild/poky-slave/nightly-external-lsb/build/build/tmp/work/ppc603e-poky-linux/slang-2.2.2-r2/slang-2.2.2/src'
| mkdir /srv/home/pokybuild/poky-slave/nightly-external-lsb/build/build/tmp/work/ppc603e-poky-linux/slang-2.2.2-r2/slang-2.2.2/src/elfobjs
| cp sysconf.h config.h
| cd /srv/home/pokybuild/poky-slave/nightly-external-lsb/build/build/tmp/work/ppc603e-poky-linux/slang-2.2.2-r2/slang-2.2.2/src/elfobjs; powerpc-poky-linux-gcc -mcpu=603e  -mhard-float --sysroot=/srv/home/pokybuild/poky-slave/nightly-external-lsb/build/build/tmp/sysroots/mpc8315e-rdb -c -O2 -pipe -g -feliminate-unused-debug-types  -fPIC  -Dunix -DSLANG -DMISC_TERMINFO_DIRS='"/srv/home/pokybuild/poky-slave/nightly-external-lsb/build/build/tmp/sysroots/x86_64-linux/usr/share/terminfo"' /srv/home/pokybuild/poky-slave/nightly-external-lsb/build/build/tmp/work/ppc603e-poky-linux/slang-2.2.2-r2/slang-2.2.2/src/sltermin.c
| cd /srv/home/pokybuild/poky-slave/nightly-external-lsb/build/build/tmp/work/ppc603e-poky-linux/slang-2.2.2-r2/slang-2.2.2/src/elfobjs; powerpc-poky-linux-gcc -mcpu=603e  -mhard-float --sysroot=/srv/home/pokybuild/poky-slave/nightly-external-lsb/build/build/tmp/sysroots/mpc8315e-rdb -c -O2 -pipe -g -feliminate-unused-debug-types  -fPIC  -Dunix -DSLANG  /srv/home/pokybuild/poky-slave/nightly-external-lsb/build/build/tmp/work/ppc603e-poky-linux/slang-2.2.2-r2/slang-2.2.2/src/sldisply.c
| cd /srv/home/pokybuild/poky-slave/nightly-external-lsb/build/build/tmp/work/ppc603e-poky-linux/slang-2.2.2-r2/slang-2.2.2/src/elfobjs; powerpc-poky-linux-gcc -mcpu=603e  -mhard-float --sysroot=/srv/home/pokybuild/poky-slave/nightly-external-lsb/build/build/tmp/sysroots/mpc8315e-rdb -c -O2 -pipe -g -feliminate-unused-debug-types  -fPIC  -Dunix -DSLANG  /srv/home/pokybuild/poky-slave/nightly-external-lsb/build/build/tmp/work/ppc603e-poky-linux/slang-2.2.2-r2/slang-2.2.2/src/slutty.c
| cd /srv/home/pokybuild/poky-slave/nightly-external-lsb/build/build/tmp/work/ppc603e-poky-linux/slang-2.2.2-r2/slang-2.2.2/src/elfobjs; powerpc-poky-linux-gcc -mcpu=603e  -mhard-float --sysroot=/srv/home/pokybuild/poky-slave/nightly-external-lsb/build/build/tmp/sysroots/mpc8315e-rdb -c -O2 -pipe -g -feliminate-unused-debug-types  -fPIC  -Dunix -DSLANG  /srv/home/pokybuild/poky-slave/nightly-external-lsb/build/build/tmp/work/ppc603e-poky-linux/slang-2.2.2-r2/slang-2.2.2/src/slang.c
| cd /srv/home/pokybuild/poky-slave/nightly-external-lsb/build/build/tmp/work/ppc603e-poky-linux/slang-2.2.2-r2/slang-2.2.2/src/elfobjs; powerpc-poky-linux-gcc -mcpu=603e  -mhard-float --sysroot=/srv/home/pokybuild/poky-slave/nightly-external-lsb/build/build/tmp/sysroots/mpc8315e-rdb -c -O2 -pipe -g -feliminate-unused-debug-types  -fPIC  -Dunix -DSLANG  /srv/home/pokybuild/poky-slave/nightly-external-lsb/build/build/tmp/work/ppc603e-poky-linux/slang-2.2.2-r2/slang-2.2.2/src/slarray.c
| cd /srv/home/pokybuild/poky-slave/nightly-external-lsb/build/build/tmp/work/ppc603e-poky-linux/slang-2.2.2-r2/slang-2.2.2/src/elfobjs; powerpc-poky-linux-gcc -mcpu=603e  -mhard-float --sysroot=/srv/home/pokybuild/poky-slave/nightly-external-lsb/build/build/tmp/sysroots/mpc8315e-rdb -c -O2 -pipe -g -feliminate-unused-debug-types  -fPIC  -Dunix -DSLANG  /srv/home/pokybuild/poky-slave/nightly-external-lsb/build/build/tmp/work/ppc603e-poky-linux/slang-2.2.2-r2/slang-2.2.2/src/slclass.c
| cd /srv/home/pokybuild/poky-slave/nightly-external-lsb/build/build/tmp/work/ppc603e-poky-linux/slang-2.2.2-r2/slang-2.2.2/src/elfobjs; powerpc-poky-linux-gcc -mcpu=603e  -mhard-float --sysroot=/srv/home/pokybuild/poky-slave/nightly-external-lsb/build/build/tmp/sysroots/mpc8315e-rdb -c -O2 -pipe -g -feliminate-unused-debug-types  -fPIC  -Dunix -DSLANG  /srv/home/pokybuild/poky-slave/nightly-external-lsb/build/build/tmp/work/ppc603e-poky-linux/slang-2.2.2-r2/slang-2.2.2/src/slcmd.c
| cd /srv/home/pokybuild/poky-slave/nightly-external-lsb/build/build/tmp/work/ppc603e-poky-linux/slang-2.2.2-r2/slang-2.2.2/src/elfobjs; powerpc-poky-linux-gcc -mcpu=603e  -mhard-float --sysroot=/srv/home/pokybuild/poky-slave/nightly-external-lsb/build/build/tmp/sysroots/mpc8315e-rdb -c -O2 -pipe -g -feliminate-unused-debug-types  -fPIC  -Dunix -DSLANG  /srv/home/pokybuild/poky-slave/nightly-external-lsb/build/build/tmp/work/ppc603e-poky-linux/slang-2.2.2-r2/slang-2.2.2/src/slerr.c
| cd /srv/home/pokybuild/poky-slave/nightly-external-lsb/build/build/tmp/work/ppc603e-poky-linux/slang-2.2.2-r2/slang-2.2.2/src/elfobjs; powerpc-poky-linux-gcc -mcpu=603e  -mhard-float --sysroot=/srv/home/pokybuild/poky-slave/nightly-external-lsb/build/build/tmp/sysroots/mpc8315e-rdb -c -O2 -pipe -g -feliminate-unused-debug-types  -fPIC  -Dunix -DSLANG  /srv/home/pokybuild/poky-slave/nightly-external-lsb/build/build/tmp/work/ppc603e-poky-linux/slang-2.2.2-r2/slang-2.2.2/src/slgetkey.c
| cd /srv/home/pokybuild/poky-slave/nightly-external-lsb/build/build/tmp/work/ppc603e-poky-linux/slang-2.2.2-r2/slang-2.2.2/src/elfobjs; powerpc-poky-linux-gcc -mcpu=603e  -mhard-float --sysroot=/srv/home/pokybuild/poky-slave/nightly-external-lsb/build/build/tmp/sysroots/mpc8315e-rdb -c -O2 -pipe -g -feliminate-unused-debug-types  -fPIC  -Dunix -DSLANG  /srv/home/pokybuild/poky-slave/nightly-external-lsb/build/build/tmp/work/ppc603e-poky-linux/slang-2.2.2-r2/slang-2.2.2/src/slkeymap.c
| /bin/sh: line 0: cd: /srv/home/pokybuild/poky-slave/nightly-external-lsb/build/build/tmp/work/ppc603e-poky-linux/slang-2.2.2-r2/slang-2.2.2/src/elfobjs: No such file or directory
| cd /srv/home/pokybuild/poky-slave/nightly-external-lsb/build/build/tmp/work/ppc603e-poky-linux/slang-2.2.2-r2/slang-2.2.2/src/elfobjs; powerpc-poky-linux-gcc -mcpu=603e  -mhard-float --sysroot=/srv/home/pokybuild/poky-slave/nightly-external-lsb/build/build/tmp/sysroots/mpc8315e-rdb -c -O2 -pipe -g -feliminate-unused-debug-types  -fPIC  -Dunix -DSLANG  /srv/home/pokybuild/poky-slave/nightly-external-lsb/build/build/tmp/work/ppc603e-poky-linux/slang-2.2.2-r2/slang-2.2.2/src/slmalloc.c
| /bin/sh: line 0: cd: /srv/home/pokybuild/poky-slave/nightly-external-lsb/build/build/tmp/work/ppc603e-poky-linux/slang-2.2.2-r2/slang-2.2.2/src/elfobjs: No such file or directory
| cd /srv/home/pokybuild/poky-slave/nightly-external-lsb/build/build/tmp/work/ppc603e-poky-linux/slang-2.2.2-r2/slang-2.2.2/src/elfobjs; powerpc-poky-linux-gcc -mcpu=603e  -mhard-float --sysroot=/srv/home/pokybuild/poky-slave/nightly-external-lsb/build/build/tmp/sysroots/mpc8315e-rdb -c -O2 -pipe -g -feliminate-unused-debug-types  -fPIC  -Dunix -DSLANG  /srv/home/pokybuild/poky-slave/nightly-external-lsb/build/build/tmp/work/ppc603e-poky-linux/slang-2.2.2-r2/slang-2.2.2/src/slmath.c
| cd /srv/home/pokybuild/poky-slave/nightly-external-lsb/build/build/tmp/work/ppc603e-poky-linux/slang-2.2.2-r2/slang-2.2.2/src/elfobjs; powerpc-poky-linux-gcc -mcpu=603e  -mhard-float --sysroot=/srv/home/pokybuild/poky-slave/nightly-external-lsb/build/build/tmp/sysroots/mpc8315e-rdb -c -O2 -pipe -g -feliminate-unused-debug-types  -fPIC  -Dunix -DSLANG  /srv/home/pokybuild/poky-slave/nightly-external-lsb/build/build/tmp/work/ppc603e-poky-linux/slang-2.2.2-r2/slang-2.2.2/src/slmemchr.c
| cd /srv/home/pokybuild/poky-slave/nightly-external-lsb/build/build/tmp/work/ppc603e-poky-linux/slang-2.2.2-r2/slang-2.2.2/src/elfobjs; powerpc-poky-linux-gcc -mcpu=603e  -mhard-float --sysroot=/srv/home/pokybuild/poky-slave/nightly-external-lsb/build/build/tmp/sysroots/mpc8315e-rdb -c -O2 -pipe -g -feliminate-unused-debug-types  -fPIC  -Dunix -DSLANG  /srv/home/pokybuild/poky-slave/nightly-external-lsb/build/build/tmp/work/ppc603e-poky-linux/slang-2.2.2-r2/slang-2.2.2/src/slmemcmp.c
| cd /srv/home/pokybuild/poky-slave/nightly-external-lsb/build/build/tmp/work/ppc603e-poky-linux/slang-2.2.2-r2/slang-2.2.2/src/elfobjs; powerpc-poky-linux-gcc -mcpu=603e  -mhard-float --sysroot=/srv/home/pokybuild/poky-slave/nightly-external-lsb/build/build/tmp/sysroots/mpc8315e-rdb -c -O2 -pipe -g -feliminate-unused-debug-types  -fPIC  -Dunix -DSLANG  /srv/home/pokybuild/poky-slave/nightly-external-lsb/build/build/tmp/work/ppc603e-poky-linux/slang-2.2.2-r2/slang-2.2.2/src/slmemcpy.c
| cd /srv/home/pokybuild/poky-slave/nightly-external-lsb/build/build/tmp/work/ppc603e-poky-linux/slang-2.2.2-r2/slang-2.2.2/src/elfobjs; powerpc-poky-linux-gcc -mcpu=603e  -mhard-float --sysroot=/srv/home/pokybuild/poky-slave/nightly-external-lsb/build/build/tmp/sysroots/mpc8315e-rdb -c -O2 -pipe -g -feliminate-unused-debug-types  -fPIC  -Dunix -DSLANG  /srv/home/pokybuild/poky-slave/nightly-external-lsb/build/build/tmp/work/ppc603e-poky-linux/slang-2.2.2-r2/slang-2.2.2/src/slmemset.c
| cd /srv/home/pokybuild/poky-slave/nightly-external-lsb/build/build/tmp/work/ppc603e-poky-linux/slang-2.2.2-r2/slang-2.2.2/src/elfobjs; powerpc-poky-linux-gcc -mcpu=603e  -mhard-float --sysroot=/srv/home/pokybuild/poky-slave/nightly-external-lsb/build/build/tmp/sysroots/mpc8315e-rdb -c -O2 -pipe -g -feliminate-unused-debug-types  -fPIC  -Dunix -DSLANG  /srv/home/pokybuild/poky-slave/nightly-external-lsb/build/build/tmp/work/ppc603e-poky-linux/slang-2.2.2-r2/slang-2.2.2/src/slmisc.c
| cd /srv/home/pokybuild/poky-slave/nightly-external-lsb/build/build/tmp/work/ppc603e-poky-linux/slang-2.2.2-r2/slang-2.2.2/src/elfobjs; powerpc-poky-linux-gcc -mcpu=603e  -mhard-float --sysroot=/srv/home/pokybuild/poky-slave/nightly-external-lsb/build/build/tmp/sysroots/mpc8315e-rdb -c -O2 -pipe -g -feliminate-unused-debug-types  -fPIC  -Dunix -DSLANG  /srv/home/pokybuild/poky-slave/nightly-external-lsb/build/build/tmp/work/ppc603e-poky-linux/slang-2.2.2-r2/slang-2.2.2/src/slparse.c
| cd /srv/home/pokybuild/poky-slave/nightly-external-lsb/build/build/tmp/work/ppc603e-poky-linux/slang-2.2.2-r2/slang-2.2.2/src/elfobjs; powerpc-poky-linux-gcc -mcpu=603e  -mhard-float --sysroot=/srv/home/pokybuild/poky-slave/nightly-external-lsb/build/build/tmp/sysroots/mpc8315e-rdb -c -O2 -pipe -g -feliminate-unused-debug-types  -fPIC  -Dunix -DSLANG  /srv/home/pokybuild/poky-slave/nightly-external-lsb/build/build/tmp/work/ppc603e-poky-linux/slang-2.2.2-r2/slang-2.2.2/src/slprepr.c
| cd /srv/home/pokybuild/poky-slave/nightly-external-lsb/build/build/tmp/work/ppc603e-poky-linux/slang-2.2.2-r2/slang-2.2.2/src/elfobjs; powerpc-poky-linux-gcc -mcpu=603e  -mhard-float --sysroot=/srv/home/pokybuild/poky-slave/nightly-external-lsb/build/build/tmp/sysroots/mpc8315e-rdb -c -O2 -pipe -g -feliminate-unused-debug-types  -fPIC  -Dunix -DSLANG  /srv/home/pokybuild/poky-slave/nightly-external-lsb/build/build/tmp/work/ppc603e-poky-linux/slang-2.2.2-r2/slang-2.2.2/src/slregexp.c
| cd /srv/home/pokybuild/poky-slave/nightly-external-lsb/build/build/tmp/work/ppc603e-poky-linux/slang-2.2.2-r2/slang-2.2.2/src/elfobjs; powerpc-poky-linux-gcc -mcpu=603e  -mhard-float --sysroot=/srv/home/pokybuild/poky-slave/nightly-external-lsb/build/build/tmp/sysroots/mpc8315e-rdb -c -O2 -pipe -g -feliminate-unused-debug-types  -fPIC  -Dunix -DSLANG  /srv/home/pokybuild/poky-slave/nightly-external-lsb/build/build/tmp/work/ppc603e-poky-linux/slang-2.2.2-r2/slang-2.2.2/src/slrline.c
| cd /srv/home/pokybuild/poky-slave/nightly-external-lsb/build/build/tmp/work/ppc603e-poky-linux/slang-2.2.2-r2/slang-2.2.2/src/elfobjs; powerpc-poky-linux-gcc -mcpu=603e  -mhard-float --sysroot=/srv/home/pokybuild/poky-slave/nightly-external-lsb/build/build/tmp/sysroots/mpc8315e-rdb -c -O2 -pipe -g -feliminate-unused-debug-types  -fPIC  -Dunix -DSLANG  /srv/home/pokybuild/poky-slave/nightly-external-lsb/build/build/tmp/work/ppc603e-poky-linux/slang-2.2.2-r2/slang-2.2.2/src/slsearch.c
| cd /srv/home/pokybuild/poky-slave/nightly-external-lsb/build/build/tmp/work/ppc603e-poky-linux/slang-2.2.2-r2/slang-2.2.2/src/elfobjs; powerpc-poky-linux-gcc -mcpu=603e  -mhard-float --sysroot=/srv/home/pokybuild/poky-slave/nightly-external-lsb/build/build/tmp/sysroots/mpc8315e-rdb -c -O2 -pipe -g -feliminate-unused-debug-types  -fPIC  -Dunix -DSLANG  /srv/home/pokybuild/poky-slave/nightly-external-lsb/build/build/tmp/work/ppc603e-poky-linux/slang-2.2.2-r2/slang-2.2.2/src/slsmg.c
| cd /srv/home/pokybuild/poky-slave/nightly-external-lsb/build/build/tmp/work/ppc603e-poky-linux/slang-2.2.2-r2/slang-2.2.2/src/elfobjs; powerpc-poky-linux-gcc -mcpu=603e  -mhard-float --sysroot=/srv/home/pokybuild/poky-slave/nightly-external-lsb/build/build/tmp/sysroots/mpc8315e-rdb -c -O2 -pipe -g -feliminate-unused-debug-types  -fPIC  -Dunix -DSLANG -DSLANG_DOC_DIR='"/usr/share/doc/slang/v2"' -DSLANG_INSTALL_PREFIX='"/usr"' /srv/home/pokybuild/poky-slave/nightly-external-lsb/build/build/tmp/work/ppc603e-poky-linux/slang-2.2.2-r2/slang-2.2.2/src/slstd.c
| cd /srv/home/pokybuild/poky-slave/nightly-external-lsb/build/build/tmp/work/ppc603e-poky-linux/slang-2.2.2-r2/slang-2.2.2/src/elfobjs; powerpc-poky-linux-gcc -mcpu=603e  -mhard-float --sysroot=/srv/home/pokybuild/poky-slave/nightly-external-lsb/build/build/tmp/sysroots/mpc8315e-rdb -c -O2 -pipe -g -feliminate-unused-debug-types  -fPIC  -Dunix -DSLANG  /srv/home/pokybuild/poky-slave/nightly-external-lsb/build/build/tmp/work/ppc603e-poky-linux/slang-2.2.2-r2/slang-2.2.2/src/sltoken.c
| cd /srv/home/pokybuild/poky-slave/nightly-external-lsb/build/build/tmp/work/ppc603e-poky-linux/slang-2.2.2-r2/slang-2.2.2/src/elfobjs; powerpc-poky-linux-gcc -mcpu=603e  -mhard-float --sysroot=/srv/home/pokybuild/poky-slave/nightly-external-lsb/build/build/tmp/sysroots/mpc8315e-rdb -c -O2 -pipe -g -feliminate-unused-debug-types  -fPIC  -Dunix -DSLANG  /srv/home/pokybuild/poky-slave/nightly-external-lsb/build/build/tmp/work/ppc603e-poky-linux/slang-2.2.2-r2/slang-2.2.2/src/sltypes.c
| cd /srv/home/pokybuild/poky-slave/nightly-external-lsb/build/build/tmp/work/ppc603e-poky-linux/slang-2.2.2-r2/slang-2.2.2/src/elfobjs; powerpc-poky-linux-gcc -mcpu=603e  -mhard-float --sysroot=/srv/home/pokybuild/poky-slave/nightly-external-lsb/build/build/tmp/sysroots/mpc8315e-rdb -c -O2 -pipe -g -feliminate-unused-debug-types  -fPIC  -Dunix -DSLANG  /srv/home/pokybuild/poky-slave/nightly-external-lsb/build/build/tmp/work/ppc603e-poky-linux/slang-2.2.2-r2/slang-2.2.2/src/slxstrng.c
| cd /srv/home/pokybuild/poky-slave/nightly-external-lsb/build/build/tmp/work/ppc603e-poky-linux/slang-2.2.2-r2/slang-2.2.2/src/elfobjs; powerpc-poky-linux-gcc -mcpu=603e  -mhard-float --sysroot=/srv/home/pokybuild/poky-slave/nightly-external-lsb/build/build/tmp/sysroots/mpc8315e-rdb -c -O2 -pipe -g -feliminate-unused-debug-types  -fPIC  -Dunix -DSLANG  /srv/home/pokybuild/poky-slave/nightly-external-lsb/build/build/tmp/work/ppc603e-poky-linux/slang-2.2.2-r2/slang-2.2.2/src/slcurses.c
| cd /srv/home/pokybuild/poky-slave/nightly-external-lsb/build/build/tmp/work/ppc603e-poky-linux/slang-2.2.2-r2/slang-2.2.2/src/elfobjs; powerpc-poky-linux-gcc -mcpu=603e  -mhard-float --sysroot=/srv/home/pokybuild/poky-slave/nightly-external-lsb/build/build/tmp/sysroots/mpc8315e-rdb -c -O2 -pipe -g -feliminate-unused-debug-types  -fPIC  -Dunix -DSLANG  /srv/home/pokybuild/poky-slave/nightly-external-lsb/build/build/tmp/work/ppc603e-poky-linux/slang-2.2.2-r2/slang-2.2.2/src/slscroll.c
| cd /srv/home/pokybuild/poky-slave/nightly-external-lsb/build/build/tmp/work/ppc603e-poky-linux/slang-2.2.2-r2/slang-2.2.2/src/elfobjs; powerpc-poky-linux-gcc -mcpu=603e  -mhard-float --sysroot=/srv/home/pokybuild/poky-slave/nightly-external-lsb/build/build/tmp/sysroots/mpc8315e-rdb -c -O2 -pipe -g -feliminate-unused-debug-types  -fPIC  -Dunix -DSLANG  /srv/home/pokybuild/poky-slave/nightly-external-lsb/build/build/tmp/work/ppc603e-poky-linux/slang-2.2.2-r2/slang-2.2.2/src/slsignal.c
| cd /srv/home/pokybuild/poky-slave/nightly-external-lsb/build/build/tmp/work/ppc603e-poky-linux/slang-2.2.2-r2/slang-2.2.2/src/elfobjs; powerpc-poky-linux-gcc -mcpu=603e  -mhard-float --sysroot=/srv/home/pokybuild/poky-slave/nightly-external-lsb/build/build/tmp/sysroots/mpc8315e-rdb -c -O2 -pipe -g -feliminate-unused-debug-types  -fPIC  -Dunix -DSLANG  /srv/home/pokybuild/poky-slave/nightly-external-lsb/build/build/tmp/work/ppc603e-poky-linux/slang-2.2.2-r2/slang-2.2.2/src/slkeypad.c
| cd /srv/home/pokybuild/poky-slave/nightly-external-lsb/build/build/tmp/work/ppc603e-poky-linux/slang-2.2.2-r2/slang-2.2.2/src/elfobjs; powerpc-poky-linux-gcc -mcpu=603e  -mhard-float --sysroot=/srv/home/pokybuild/poky-slave/nightly-external-lsb/build/build/tmp/sysroots/mpc8315e-rdb -c -O2 -pipe -g -feliminate-unused-debug-types  -fPIC  -Dunix -DSLANG  /srv/home/pokybuild/poky-slave/nightly-external-lsb/build/build/tmp/work/ppc603e-poky-linux/slang-2.2.2-r2/slang-2.2.2/src/slerrno.c
| cd /srv/home/pokybuild/poky-slave/nightly-external-lsb/build/build/tmp/work/ppc603e-poky-linux/slang-2.2.2-r2/slang-2.2.2/src/elfobjs; powerpc-poky-linux-gcc -mcpu=603e  -mhard-float --sysroot=/srv/home/pokybuild/poky-slave/nightly-external-lsb/build/build/tmp/sysroots/mpc8315e-rdb -c -O2 -pipe -g -feliminate-unused-debug-types  -fPIC  -Dunix -DSLANG  /srv/home/pokybuild/poky-slave/nightly-external-lsb/build/build/tmp/work/ppc603e-poky-linux/slang-2.2.2-r2/slang-2.2.2/src/slstring.c
| cd /srv/home/pokybuild/poky-slave/nightly-external-lsb/build/build/tmp/work/ppc603e-poky-linux/slang-2.2.2-r2/slang-2.2.2/src/elfobjs; powerpc-poky-linux-gcc -mcpu=603e  -mhard-float --sysroot=/srv/home/pokybuild/poky-slave/nightly-external-lsb/build/build/tmp/sysroots/mpc8315e-rdb -c -O2 -pipe -g -feliminate-unused-debug-types  -fPIC  -Dunix -DSLANG  /srv/home/pokybuild/poky-slave/nightly-external-lsb/build/build/tmp/work/ppc603e-poky-linux/slang-2.2.2-r2/slang-2.2.2/src/slstruct.c
| cd /srv/home/pokybuild/poky-slave/nightly-external-lsb/build/build/tmp/work/ppc603e-poky-linux/slang-2.2.2-r2/slang-2.2.2/src/elfobjs; powerpc-poky-linux-gcc -mcpu=603e  -mhard-float --sysroot=/srv/home/pokybuild/poky-slave/nightly-external-lsb/build/build/tmp/sysroots/mpc8315e-rdb -c -O2 -pipe -g -feliminate-unused-debug-types  -fPIC  -Dunix -DSLANG  /srv/home/pokybuild/poky-slave/nightly-external-lsb/build/build/tmp/work/ppc603e-poky-linux/slang-2.2.2-r2/slang-2.2.2/src/slcmplex.c
| cd /srv/home/pokybuild/poky-slave/nightly-external-lsb/build/build/tmp/work/ppc603e-poky-linux/slang-2.2.2-r2/slang-2.2.2/src/elfobjs; powerpc-poky-linux-gcc -mcpu=603e  -mhard-float --sysroot=/srv/home/pokybuild/poky-slave/nightly-external-lsb/build/build/tmp/sysroots/mpc8315e-rdb -c -O2 -pipe -g -feliminate-unused-debug-types  -fPIC  -Dunix -DSLANG  /srv/home/pokybuild/poky-slave/nightly-external-lsb/build/build/tmp/work/ppc603e-poky-linux/slang-2.2.2-r2/slang-2.2.2/src/slarrfun.c
| cd /srv/home/pokybuild/poky-slave/nightly-external-lsb/build/build/tmp/work/ppc603e-poky-linux/slang-2.2.2-r2/slang-2.2.2/src/elfobjs; powerpc-poky-linux-gcc -mcpu=603e  -mhard-float --sysroot=/srv/home/pokybuild/poky-slave/nightly-external-lsb/build/build/tmp/sysroots/mpc8315e-rdb -c -O2 -pipe -g -feliminate-unused-debug-types  -fPIC  -Dunix -DSLANG -DMODULE_INSTALL_DIR='"/usr/lib/slang/v2/modules"' -DMODULE_PATH_ENV_NAME='"SLANG_MODULE_PATH"' /srv/home/pokybuild/poky-slave/nightly-external-lsb/build/build/tmp/work/ppc603e-poky-linux/slang-2.2.2-r2/slang-2.2.2/src/slimport.c
| cd /srv/home/pokybuild/poky-slave/nightly-external-lsb/build/build/tmp/work/ppc603e-poky-linux/slang-2.2.2-r2/slang-2.2.2/src/elfobjs; powerpc-poky-linux-gcc -mcpu=603e  -mhard-float --sysroot=/srv/home/pokybuild/poky-slave/nightly-external-lsb/build/build/tmp/sysroots/mpc8315e-rdb -c -O2 -pipe -g -feliminate-unused-debug-types  -fPIC  -Dunix -DSLANG  /srv/home/pokybuild/poky-slave/nightly-external-lsb/build/build/tmp/work/ppc603e-poky-linux/slang-2.2.2-r2/slang-2.2.2/src/slpath.c
| cd /srv/home/pokybuild/poky-slave/nightly-external-lsb/build/build/tmp/work/ppc603e-poky-linux/slang-2.2.2-r2/slang-2.2.2/src/elfobjs; powerpc-poky-linux-gcc -mcpu=603e  -mhard-float --sysroot=/srv/home/pokybuild/poky-slave/nightly-external-lsb/build/build/tmp/sysroots/mpc8315e-rdb -c -O2 -pipe -g -feliminate-unused-debug-types  -fPIC  -Dunix -DSLANG  /srv/home/pokybuild/poky-slave/nightly-external-lsb/build/build/tmp/work/ppc603e-poky-linux/slang-2.2.2-r2/slang-2.2.2/src/slarith.c
| cd /srv/home/pokybuild/poky-slave/nightly-external-lsb/build/build/tmp/work/ppc603e-poky-linux/slang-2.2.2-r2/slang-2.2.2/src/elfobjs; powerpc-poky-linux-gcc -mcpu=603e  -mhard-float --sysroot=/srv/home/pokybuild/poky-slave/nightly-external-lsb/build/build/tmp/sysroots/mpc8315e-rdb -c -O2 -pipe -g -feliminate-unused-debug-types  -fPIC  -Dunix -DSLANG  /srv/home/pokybuild/poky-slave/nightly-external-lsb/build/build/tmp/work/ppc603e-poky-linux/slang-2.2.2-r2/slang-2.2.2/src/slassoc.c
| cd /srv/home/pokybuild/poky-slave/nightly-external-lsb/build/build/tmp/work/ppc603e-poky-linux/slang-2.2.2-r2/slang-2.2.2/src/elfobjs; powerpc-poky-linux-gcc -mcpu=603e  -mhard-float --sysroot=/srv/home/pokybuild/poky-slave/nightly-external-lsb/build/build/tmp/sysroots/mpc8315e-rdb -c -O2 -pipe -g -feliminate-unused-debug-types  -fPIC  -Dunix -DSLANG  /srv/home/pokybuild/poky-slave/nightly-external-lsb/build/build/tmp/work/ppc603e-poky-linux/slang-2.2.2-r2/slang-2.2.2/src/slcompat.c
| cd /srv/home/pokybuild/poky-slave/nightly-external-lsb/build/build/tmp/work/ppc603e-poky-linux/slang-2.2.2-r2/slang-2.2.2/src/elfobjs; powerpc-poky-linux-gcc -mcpu=603e  -mhard-float --sysroot=/srv/home/pokybuild/poky-slave/nightly-external-lsb/build/build/tmp/sysroots/mpc8315e-rdb -c -O2 -pipe -g -feliminate-unused-debug-types  -fPIC  -Dunix -DSLANG  /srv/home/pokybuild/poky-slave/nightly-external-lsb/build/build/tmp/work/ppc603e-poky-linux/slang-2.2.2-r2/slang-2.2.2/src/slposdir.c
| cd /srv/home/pokybuild/poky-slave/nightly-external-lsb/build/build/tmp/work/ppc603e-poky-linux/slang-2.2.2-r2/slang-2.2.2/src/elfobjs; powerpc-poky-linux-gcc -mcpu=603e  -mhard-float --sysroot=/srv/home/pokybuild/poky-slave/nightly-external-lsb/build/build/tmp/sysroots/mpc8315e-rdb -c -O2 -pipe -g -feliminate-unused-debug-types  -fPIC  -Dunix -DSLANG  /srv/home/pokybuild/poky-slave/nightly-external-lsb/build/build/tmp/work/ppc603e-poky-linux/slang-2.2.2-r2/slang-2.2.2/src/slstdio.c
| cd /srv/home/pokybuild/poky-slave/nightly-external-lsb/build/build/tmp/work/ppc603e-poky-linux/slang-2.2.2-r2/slang-2.2.2/src/elfobjs; powerpc-poky-linux-gcc -mcpu=603e  -mhard-float --sysroot=/srv/home/pokybuild/poky-slave/nightly-external-lsb/build/build/tmp/sysroots/mpc8315e-rdb -c -O2 -pipe -g -feliminate-unused-debug-types  -fPIC  -Dunix -DSLANG  /srv/home/pokybuild/poky-slave/nightly-external-lsb/build/build/tmp/work/ppc603e-poky-linux/slang-2.2.2-r2/slang-2.2.2/src/slproc.c
| cd /srv/home/pokybuild/poky-slave/nightly-external-lsb/build/build/tmp/work/ppc603e-poky-linux/slang-2.2.2-r2/slang-2.2.2/src/elfobjs; powerpc-poky-linux-gcc -mcpu=603e  -mhard-float --sysroot=/srv/home/pokybuild/poky-slave/nightly-external-lsb/build/build/tmp/sysroots/mpc8315e-rdb -c -O2 -pipe -g -feliminate-unused-debug-types  -fPIC  -Dunix -DSLANG  /srv/home/pokybuild/poky-slave/nightly-external-lsb/build/build/tmp/work/ppc603e-poky-linux/slang-2.2.2-r2/slang-2.2.2/src/sltime.c
| cd /srv/home/pokybuild/poky-slave/nightly-external-lsb/build/build/tmp/work/ppc603e-poky-linux/slang-2.2.2-r2/slang-2.2.2/src/elfobjs; powerpc-poky-linux-gcc -mcpu=603e  -mhard-float --sysroot=/srv/home/pokybuild/poky-slave/nightly-external-lsb/build/build/tmp/sysroots/mpc8315e-rdb -c -O2 -pipe -g -feliminate-unused-debug-types  -fPIC  -Dunix -DSLANG  /srv/home/pokybuild/poky-slave/nightly-external-lsb/build/build/tmp/work/ppc603e-poky-linux/slang-2.2.2-r2/slang-2.2.2/src/slstrops.c
| cd /srv/home/pokybuild/poky-slave/nightly-external-lsb/build/build/tmp/work/ppc603e-poky-linux/slang-2.2.2-r2/slang-2.2.2/src/elfobjs; powerpc-poky-linux-gcc -mcpu=603e  -mhard-float --sysroot=/srv/home/pokybuild/poky-slave/nightly-external-lsb/build/build/tmp/sysroots/mpc8315e-rdb -c -O2 -pipe -g -feliminate-unused-debug-types  -fPIC  -Dunix -DSLANG  /srv/home/pokybuild/poky-slave/nightly-external-lsb/build/build/tmp/work/ppc603e-poky-linux/slang-2.2.2-r2/slang-2.2.2/src/slbstr.c
| cd /srv/home/pokybuild/poky-slave/nightly-external-lsb/build/build/tmp/work/ppc603e-poky-linux/slang-2.2.2-r2/slang-2.2.2/src/elfobjs; powerpc-poky-linux-gcc -mcpu=603e  -mhard-float --sysroot=/srv/home/pokybuild/poky-slave/nightly-external-lsb/build/build/tmp/sysroots/mpc8315e-rdb -c -O2 -pipe -g -feliminate-unused-debug-types  -fPIC  -Dunix -DSLANG  /srv/home/pokybuild/poky-slave/nightly-external-lsb/build/build/tmp/work/ppc603e-poky-linux/slang-2.2.2-r2/slang-2.2.2/src/slpack.c
| cd /srv/home/pokybuild/poky-slave/nightly-external-lsb/build/build/tmp/work/ppc603e-poky-linux/slang-2.2.2-r2/slang-2.2.2/src/elfobjs; powerpc-poky-linux-gcc -mcpu=603e  -mhard-float --sysroot=/srv/home/pokybuild/poky-slave/nightly-external-lsb/build/build/tmp/sysroots/mpc8315e-rdb -c -O2 -pipe -g -feliminate-unused-debug-types  -fPIC  -Dunix -DSLANG  /srv/home/pokybuild/poky-slave/nightly-external-lsb/build/build/tmp/work/ppc603e-poky-linux/slang-2.2.2-r2/slang-2.2.2/src/slintall.c
| cd /srv/home/pokybuild/poky-slave/nightly-external-lsb/build/build/tmp/work/ppc603e-poky-linux/slang-2.2.2-r2/slang-2.2.2/src/elfobjs; powerpc-poky-linux-gcc -mcpu=603e  -mhard-float --sysroot=/srv/home/pokybuild/poky-slave/nightly-external-lsb/build/build/tmp/sysroots/mpc8315e-rdb -c -O2 -pipe -g -feliminate-unused-debug-types  -fPIC  -Dunix -DSLANG  /srv/home/pokybuild/poky-slave/nightly-external-lsb/build/build/tmp/work/ppc603e-poky-linux/slang-2.2.2-r2/slang-2.2.2/src/slistruc.c
| cd /srv/home/pokybuild/poky-slave/nightly-external-lsb/build/build/tmp/work/ppc603e-poky-linux/slang-2.2.2-r2/slang-2.2.2/src/elfobjs; powerpc-poky-linux-gcc -mcpu=603e  -mhard-float --sysroot=/srv/home/pokybuild/poky-slave/nightly-external-lsb/build/build/tmp/sysroots/mpc8315e-rdb -c -O2 -pipe -g -feliminate-unused-debug-types  -fPIC  -Dunix -DSLANG  /srv/home/pokybuild/poky-slave/nightly-external-lsb/build/build/tmp/work/ppc603e-poky-linux/slang-2.2.2-r2/slang-2.2.2/src/slposio.c
| cd /srv/home/pokybuild/poky-slave/nightly-external-lsb/build/build/tmp/work/ppc603e-poky-linux/slang-2.2.2-r2/slang-2.2.2/src/elfobjs; powerpc-poky-linux-gcc -mcpu=603e  -mhard-float --sysroot=/srv/home/pokybuild/poky-slave/nightly-external-lsb/build/build/tmp/sysroots/mpc8315e-rdb -c -O2 -pipe -g -feliminate-unused-debug-types  -fPIC  -Dunix -DSLANG  /srv/home/pokybuild/poky-slave/nightly-external-lsb/build/build/tmp/work/ppc603e-poky-linux/slang-2.2.2-r2/slang-2.2.2/src/slnspace.c
| cd /srv/home/pokybuild/poky-slave/nightly-external-lsb/build/build/tmp/work/ppc603e-poky-linux/slang-2.2.2-r2/slang-2.2.2/src/elfobjs; powerpc-poky-linux-gcc -mcpu=603e  -mhard-float --sysroot=/srv/home/pokybuild/poky-slave/nightly-external-lsb/build/build/tmp/sysroots/mpc8315e-rdb -c -O2 -pipe -g -feliminate-unused-debug-types  -fPIC  -Dunix -DSLANG  /srv/home/pokybuild/poky-slave/nightly-external-lsb/build/build/tmp/work/ppc603e-poky-linux/slang-2.2.2-r2/slang-2.2.2/src/slarrmis.c
| cd /srv/home/pokybuild/poky-slave/nightly-external-lsb/build/build/tmp/work/ppc603e-poky-linux/slang-2.2.2-r2/slang-2.2.2/src/elfobjs; powerpc-poky-linux-gcc -mcpu=603e  -mhard-float --sysroot=/srv/home/pokybuild/poky-slave/nightly-external-lsb/build/build/tmp/sysroots/mpc8315e-rdb -c -O2 -pipe -g -feliminate-unused-debug-types  -fPIC  -Dunix -DSLANG  /srv/home/pokybuild/poky-slave/nightly-external-lsb/build/build/tmp/work/ppc603e-poky-linux/slang-2.2.2-r2/slang-2.2.2/src/slospath.c
| cd /srv/home/pokybuild/poky-slave/nightly-external-lsb/build/build/tmp/work/ppc603e-poky-linux/slang-2.2.2-r2/slang-2.2.2/src/elfobjs; powerpc-poky-linux-gcc -mcpu=603e  -mhard-float --sysroot=/srv/home/pokybuild/poky-slave/nightly-external-lsb/build/build/tmp/sysroots/mpc8315e-rdb -c -O2 -pipe -g -feliminate-unused-debug-types  -fPIC  -Dunix -DSLANG  /srv/home/pokybuild/poky-slave/nightly-external-lsb/build/build/tmp/work/ppc603e-poky-linux/slang-2.2.2-r2/slang-2.2.2/src/slscanf.c
| cd /srv/home/pokybuild/poky-slave/nightly-external-lsb/build/build/tmp/work/ppc603e-poky-linux/slang-2.2.2-r2/slang-2.2.2/src/elfobjs; powerpc-poky-linux-gcc -mcpu=603e  -mhard-float --sysroot=/srv/home/pokybuild/poky-slave/nightly-external-lsb/build/build/tmp/sysroots/mpc8315e-rdb -c -O2 -pipe -g -feliminate-unused-debug-types  -fPIC  -Dunix -DSLANG  /srv/home/pokybuild/poky-slave/nightly-external-lsb/build/build/tmp/work/ppc603e-poky-linux/slang-2.2.2-r2/slang-2.2.2/src/sllower.c
| cd /srv/home/pokybuild/poky-slave/nightly-external-lsb/build/build/tmp/work/ppc603e-poky-linux/slang-2.2.2-r2/slang-2.2.2/src/elfobjs; powerpc-poky-linux-gcc -mcpu=603e  -mhard-float --sysroot=/srv/home/pokybuild/poky-slave/nightly-external-lsb/build/build/tmp/sysroots/mpc8315e-rdb -c -O2 -pipe -g -feliminate-unused-debug-types  -fPIC  -Dunix -DSLANG  /srv/home/pokybuild/poky-slave/nightly-external-lsb/build/build/tmp/work/ppc603e-poky-linux/slang-2.2.2-r2/slang-2.2.2/src/slupper.c
| cd /srv/home/pokybuild/poky-slave/nightly-external-lsb/build/build/tmp/work/ppc603e-poky-linux/slang-2.2.2-r2/slang-2.2.2/src/elfobjs; powerpc-poky-linux-gcc -mcpu=603e  -mhard-float --sysroot=/srv/home/pokybuild/poky-slave/nightly-external-lsb/build/build/tmp/sysroots/mpc8315e-rdb -c -O2 -pipe -g -feliminate-unused-debug-types  -fPIC  -Dunix -DSLANG  /srv/home/pokybuild/poky-slave/nightly-external-lsb/build/build/tmp/work/ppc603e-poky-linux/slang-2.2.2-r2/slang-2.2.2/src/slischar.c
| cd /srv/home/pokybuild/poky-slave/nightly-external-lsb/build/build/tmp/work/ppc603e-poky-linux/slang-2.2.2-r2/slang-2.2.2/src/elfobjs; powerpc-poky-linux-gcc -mcpu=603e  -mhard-float --sysroot=/srv/home/pokybuild/poky-slave/nightly-external-lsb/build/build/tmp/sysroots/mpc8315e-rdb -c -O2 -pipe -g -feliminate-unused-debug-types  -fPIC  -Dunix -DSLANG  /srv/home/pokybuild/poky-slave/nightly-external-lsb/build/build/tmp/work/ppc603e-poky-linux/slang-2.2.2-r2/slang-2.2.2/src/slutf8.c
| cd /srv/home/pokybuild/poky-slave/nightly-external-lsb/build/build/tmp/work/ppc603e-poky-linux/slang-2.2.2-r2/slang-2.2.2/src/elfobjs; powerpc-poky-linux-gcc -mcpu=603e  -mhard-float --sysroot=/srv/home/pokybuild/poky-slave/nightly-external-lsb/build/build/tmp/sysroots/mpc8315e-rdb -c -O2 -pipe -g -feliminate-unused-debug-types  -fPIC  -Dunix -DSLANG  /srv/home/pokybuild/poky-slave/nightly-external-lsb/build/build/tmp/work/ppc603e-poky-linux/slang-2.2.2-r2/slang-2.2.2/src/slwcwidth.c
| cd /srv/home/pokybuild/poky-slave/nightly-external-lsb/build/build/tmp/work/ppc603e-poky-linux/slang-2.2.2-r2/slang-2.2.2/src/elfobjs; powerpc-poky-linux-gcc -mcpu=603e  -mhard-float --sysroot=/srv/home/pokybuild/poky-slave/nightly-external-lsb/build/build/tmp/sysroots/mpc8315e-rdb -c -O2 -pipe -g -feliminate-unused-debug-types  -fPIC  -Dunix -DSLANG  /srv/home/pokybuild/poky-slave/nightly-external-lsb/build/build/tmp/work/ppc603e-poky-linux/slang-2.2.2-r2/slang-2.2.2/src/slwclut.c
| cd /srv/home/pokybuild/poky-slave/nightly-external-lsb/build/build/tmp/work/ppc603e-poky-linux/slang-2.2.2-r2/slang-2.2.2/src/elfobjs; powerpc-poky-linux-gcc -mcpu=603e  -mhard-float --sysroot=/srv/home/pokybuild/poky-slave/nightly-external-lsb/build/build/tmp/sysroots/mpc8315e-rdb -c -O2 -pipe -g -feliminate-unused-debug-types  -fPIC  -Dunix -DSLANG  /srv/home/pokybuild/poky-slave/nightly-external-lsb/build/build/tmp/work/ppc603e-poky-linux/slang-2.2.2-r2/slang-2.2.2/src/slcommon.c
| cd /srv/home/pokybuild/poky-slave/nightly-external-lsb/build/build/tmp/work/ppc603e-poky-linux/slang-2.2.2-r2/slang-2.2.2/src/elfobjs; powerpc-poky-linux-gcc -mcpu=603e  -mhard-float --sysroot=/srv/home/pokybuild/poky-slave/nightly-external-lsb/build/build/tmp/sysroots/mpc8315e-rdb -c -O2 -pipe -g -feliminate-unused-debug-types  -fPIC  -Dunix -DSLANG  /srv/home/pokybuild/poky-slave/nightly-external-lsb/build/build/tmp/work/ppc603e-poky-linux/slang-2.2.2-r2/slang-2.2.2/src/sllist.c
| cd /srv/home/pokybuild/poky-slave/nightly-external-lsb/build/build/tmp/work/ppc603e-poky-linux/slang-2.2.2-r2/slang-2.2.2/src/elfobjs; powerpc-poky-linux-gcc -mcpu=603e  -mhard-float --sysroot=/srv/home/pokybuild/poky-slave/nightly-external-lsb/build/build/tmp/sysroots/mpc8315e-rdb -c -O2 -pipe -g -feliminate-unused-debug-types  -fPIC  -Dunix -DSLANG  /srv/home/pokybuild/poky-slave/nightly-external-lsb/build/build/tmp/work/ppc603e-poky-linux/slang-2.2.2-r2/slang-2.2.2/src/slexcept.c
| cd /srv/home/pokybuild/poky-slave/nightly-external-lsb/build/build/tmp/work/ppc603e-poky-linux/slang-2.2.2-r2/slang-2.2.2/src/elfobjs; powerpc-poky-linux-gcc -mcpu=603e  -mhard-float --sysroot=/srv/home/pokybuild/poky-slave/nightly-external-lsb/build/build/tmp/sysroots/mpc8315e-rdb -c -O2 -pipe -g -feliminate-unused-debug-types  -fPIC  -Dunix -DSLANG  /srv/home/pokybuild/poky-slave/nightly-external-lsb/build/build/tmp/work/ppc603e-poky-linux/slang-2.2.2-r2/slang-2.2.2/src/slfpu.c
| cd /srv/home/pokybuild/poky-slave/nightly-external-lsb/build/build/tmp/work/ppc603e-poky-linuxERROR: Function 'do_compile' failed (see /srv/home/pokybuild/poky-slave/nightly-external-lsb/build/build/tmp/work/ppc603e-poky-linux/slang-2.2.2-r2/temp/log.do_compile.13834 for further information)
| /slang-2.2.2-r2/slang-2.2.2/src/elfobjs; powerpc-poky-linux-gcc -mcpu=603e  -mhard-float --sysroot=/srv/home/pokybuild/poky-slave/nightly-external-lsb/build/build/tmp/sysroots/mpc8315e-rdb -c -O2 -pipe -g -feliminate-unused-debug-types  -fPIC  -Dunix -DSLANG  /srv/home/pokybuild/poky-slave/nightly-external-lsb/build/build/tmp/work/ppc603e-poky-linux/slang-2.2.2-r2/slang-2.2.2/src/slsig.c
| cd /srv/home/pokybuild/poky-slave/nightly-external-lsb/build/build/tmp/work/ppc603e-poky-linux/slang-2.2.2-r2/slang-2.2.2/src/elfobjs; powerpc-poky-linux-gcc -mcpu=603e  -mhard-float --sysroot=/srv/home/pokybuild/poky-slave/nightly-external-lsb/build/build/tmp/sysroots/mpc8315e-rdb -c -O2 -pipe -g -feliminate-unused-debug-types  -fPIC  -Dunix -DSLANG  /srv/home/pokybuild/poky-slave/nightly-external-lsb/build/build/tmp/work/ppc603e-poky-linux/slang-2.2.2-r2/slang-2.2.2/src/slboseos.c
| rm -f /srv/home/pokybuild/poky-slave/nightly-external-lsb/build/build/tmp/work/ppc603e-poky-linux/slang-2.2.2-r2/slang-2.2.2/src/elfobjs/libslang.so.2.2.2
| cd /srv/home/pokybuild/poky-slave/nightly-external-lsb/build/build/tmp/work/ppc603e-poky-linux/slang-2.2.2-r2/slang-2.2.2/src/elfobjs; powerpc-poky-linux-gcc -mcpu=603e  -mhard-float --sysroot=/srv/home/pokybuild/poky-slave/nightly-external-lsb/build/build/tmp/sysroots/mpc8315e-rdb -Wl,-O1  -Wl,--as-needed -shared -Wl,-O1 -Wl,--version-script,/srv/home/pokybuild/poky-slave/nightly-external-lsb/build/build/tmp/work/ppc603e-poky-linux/slang-2.2.2-r2/slang-2.2.2/src/slang.ver -Wl,-soname,libslang.so.2 -o libslang.so.2.2.2 sltermin.o sldisply.o slutty.o slang.o slarray.o slclass.o slcmd.o slerr.o slgetkey.o slkeymap.o slmalloc.o slmath.o slmemchr.o slmemcmp.o slmemcpy.o slmemset.o slmisc.o slparse.o slprepr.o slregexp.o slrline.o slsearch.o slsmg.o slstd.o sltoken.o sltypes.o slxstrng.o slcurses.o slscroll.o slsignal.o slkeypad.o slerrno.o slstring.o slstruct.o slcmplex.o slarrfun.o slimport.o slpath.o slarith.o slassoc.o slcompat.o slposdir.o slstdio.o slproc.o sltime.o slstrops.o slbstr.o slpack.o slintall.o slistruc.o slposio.o slnspace.o slarrmis.o slospath.o slscanf.o sllower.o slupper.o slischar.o slutf8.o slwcwidth.o slwclut.o slcommon.o sllist.o slexcept.o slfpu.o slsig.o slboseos.o -Wl,-O1  -Wl,--as-needed -ldl -lm -lc
| powerpc-poky-linux-gcc: slkeymap.o: No such file or directory
| powerpc-poky-linux-gcc: slmalloc.o: No such file or directory
| make[1]: *** [/srv/home/pokybuild/poky-slave/nightly-external-lsb/build/build/tmp/work/ppc603e-poky-linux/slang-2.2.2-r2/slang-2.2.2/src/elfobjs/libslang.so.2.2.2] Error 1
| make[1]: Leaving directory `/srv/home/pokybuild/poky-slave/nightly-external-lsb/build/build/tmp/work/ppc603e-poky-linux/slang-2.2.2-r2/slang-2.2.2/src'
| make: *** [elf] Error 2
| FATAL: oe_runmake failed
NOTE: package slang-2.2.2-r2: task do_compile: Failed
NOTE: package libevent-1.4.14b-r0: task do_configure: Started
ERROR: Task 6672 (/srv/home/pokybuild/poky-slave/nightly-external-lsb/build/meta/recipes-extended/slang/slang_2.2.2.bb, do_compile) failed with exit code '1'
.......
NOTE: Running task 7144 of 7190 (ID: 3464, /srv/home/pokybuild/poky-slave/nightly-external-lsb/build/meta/recipes-qt/qt4/qt4-x11-free_4.7.1.bb, do_package_write_rpm)
NOTE: Running task 7145 of 7190 (ID: 3463, /srv/home/pokybuild/poky-slave/nightly-external-lsb/build/meta/recipes-qt/qt4/qt4-x11-free_4.7.1.bb, do_package_write_deb)
NOTE: Running task 7146 of 7190 (ID: 3462, /srv/home/pokybuild/poky-slave/nightly-external-lsb/build/meta/recipes-qt/qt4/qt4-x11-free_4.7.1.bb, do_package_write_ipk)
NOTE: package qt4-x11-free-4.7.1-r21.1: task do_package_write_rpm: Started
NOTE: package qt4-x11-free-4.7.1-r21.1: task do_package_write_deb: Started
NOTE: package qt4-x11-free-4.7.1-r21.1: task do_package_write_ipk: Started
NOTE: package qt4-x11-free-4.7.1-r21.1: task do_package_write_ipk: Succeeded
NOTE: package qt4-x11-free-4.7.1-r21.1: task do_package_write_deb: Succeeded
NOTE: package qt4-x11-free-4.7.1-r21.1: task do_package_write_rpm: Succeeded
NOTE: Running noexec task 7147 of 7190 (ID: 3458, /srv/home/pokybuild/poky-slave/nightly-external-lsb/build/meta/recipes-qt/qt4/qt4-x11-free_4.7.1.bb, do_package_write)
NOTE: Running noexec task 7148 of 7190 (ID: 3455, /srv/home/pokybuild/poky-slave/nightly-external-lsb/build/meta/recipes-qt/qt4/qt4-x11-free_4.7.1.bb, do_build)
NOTE: Running task 7149 of 7190 (ID: 3460, /srv/home/pokybuild/poky-slave/nightly-external-lsb/build/meta/recipes-qt/qt4/qt4-x11-free_4.7.1.bb, do_rm_work)
NOTE: package qt4-x11-free-4.7.1-r21.1: task do_rm_work: Started
NOTE: package qt4-x11-free-4.7.1-r21.1: task do_rm_work: Succeeded
ERROR: '/srv/home/pokybuild/poky-slave/nightly-external-lsb/build/meta/recipes-extended/slang/slang_2.2.2.bb' failed
program finished with exit code 1
Comment 4 Saul Wold 2011-04-08 15:01:14 UTC
This bug seems to contain 2 build issues, one is the keymap issue which is a duplicate of 960 and was resolved with the following commit:

http://git.pokylinux.org/cgit/cgit.cgi/poky/commit/?id=b0bf7ef11512219d2822647058db840fd8d45df0

The second issue regarding slang, I could not reproduce during a poky-lsb
build.  Please verify this issue.  If it still fails, please open a new bug that relates to slang's failure, not mixed with the keymap failure.
Comment 5 liang li 2011-04-14 22:01:58 UTC
(In reply to comment #4)
> This bug seems to contain 2 build issues, one is the keymap issue which is a
> duplicate of 960 and was resolved with the following commit:
> 
> http://git.pokylinux.org/cgit/cgit.cgi/poky/commit/?id=b0bf7ef11512219d2822647058db840fd8d45df0
> 
> The second issue regarding slang, I could not reproduce during a poky-lsb
> build.  Please verify this issue.  If it still fails, please open a new bug
> that relates to slang's failure, not mixed with the keymap failure.

the both two issues has been solved by looking at the autobuilder build logs (nightly build 20110412-1) and the minimal,sato,sato-sdk images has been found in this autobuild build version:
git info:
6bf6aec120744211fbabf2b4a167bfd1ab5866fd

reopened the bug due to one new issue is found about lsd-sdk images build error below:

ERROR: Function 'do_compile' failed (see /srv/home/pokybuild/poky-slave/nightly-external-lsb/build/build/tmp/work/ppc603e-poky-linux/libnewt-0.52.12-r0/temp/log.do_compile.8669 for further information)
NOTE: package gst-plugins-good-0.10.26-r2: task do_rm_work: Started
ERROR: Logfile of failure stored in: /srv/home/pokybuild/poky-slave/nightly-external-lsb/build/build/tmp/work/ppc603e-poky-linux/libnewt-0.52.12-r0/temp/log.do_compile.8669
Log data follows:
| NOTE: make -j 16
| powerpc-poky-linux-gcc -E --sysroot=/srv/home/pokybuild/poky-slave/nightly-external-lsb/build/build/tmp/sysroots/mpc8315e-rdb -O2 -pipe -g -feliminate-unused-debug-types -D_GNU_SOURCE -I/usr/include/slang   -M test.c testgrid.c testtree.c showchars.c showkey.c whiptail.c dialogboxes.c newt.c button.c form.c checkbox.c entry.c label.c listbox.c scrollbar.c textbox.c scale.c grid.c windows.c buttonbar.c checkboxtree.c > .depend
| powerpc-poky-linux-gcc -mcpu=603e  -mhard-float --sysroot=/srv/home/pokybuild/poky-slave/nightly-external-lsb/build/build/tmp/sysroots/mpc8315e-rdb -O2 -pipe -g -feliminate-unused-debug-types -D_GNU_SOURCE -I/usr/include/slang    -c -o test.o test.c
| powerpc-poky-linux-gcc -mcpu=603e  -mhard-float --sysroot=/srv/home/pokybuild/poky-slave/nightly-external-lsb/build/build/tmp/sysroots/mpc8315e-rdb -O2 -pipe -g -feliminate-unused-debug-types -D_GNU_SOURCE -I/usr/include/slang    -c -o newt.o newt.c
| powerpc-poky-linux-gcc -mcpu=603e  -mhard-float --sysroot=/srv/home/pokybuild/poky-slave/nightly-external-lsb/build/build/tmp/sysroots/mpc8315e-rdb -O2 -pipe -g -feliminate-unused-debug-types -D_GNU_SOURCE -I/usr/include/slang    -c -o button.o button.c
| powerpc-poky-linux-gcc -mcpu=603e  -mhard-float --sysroot=/srv/home/pokybuild/poky-slave/nightly-external-lsb/build/build/tmp/sysroots/mpc8315e-rdb -O2 -pipe -g -feliminate-unused-debug-types -D_GNU_SOURCE -I/usr/include/slang    -c -o form.o form.c
| powerpc-poky-linux-gcc -mcpu=603e  -mhard-float --sysroot=/srv/home/pokybuild/poky-slave/nightly-external-lsb/build/build/tmp/sysroots/mpc8315e-rdb -O2 -pipe -g -feliminate-unused-debug-types -D_GNU_SOURCE -I/usr/include/slang    -c -o checkbox.o checkbox.c
| powerpc-poky-linux-gcc -mcpu=603e  -mhard-float --sysroot=/srv/home/pokybuild/poky-slave/nightly-external-lsb/build/build/tmp/sysroots/mpc8315e-rdb -O2 -pipe -g -feliminate-unused-debug-types -D_GNU_SOURCE -I/usr/include/slang    -c -o entry.o entry.c
| powerpc-poky-linux-gcc -mcpu=603e  -mhard-float --sysroot=/srv/home/pokybuild/poky-slave/nightly-external-lsb/build/build/tmp/sysroots/mpc8315e-rdb -O2 -pipe -g -feliminate-unused-debug-types -D_GNU_SOURCE -I/usr/include/slang    -c -o label.o label.c
| powerpc-poky-linux-gcc -mcpu=603e  -mhard-float --sysroot=/srv/home/pokybuild/poky-slave/nightly-external-lsb/build/build/tmp/sysroots/mpc8315e-rdb -O2 -pipe -g -feliminate-unused-debug-types -D_GNU_SOURCE -I/usr/include/slang    -c -o listbox.o listbox.c
| powerpc-poky-linux-gcc -mcpu=603e  -mhard-float --sysroot=/srv/home/pokybuild/poky-slave/nightly-external-lsb/build/build/tmp/sysroots/mpc8315e-rdb -O2 -pipe -g -feliminate-unused-debug-types -D_GNU_SOURCE -I/usr/include/slang    -c -o scrollbar.o scrollbar.c
| powerpc-poky-linux-gcc -mcpu=603e  -mhard-float --sysroot=/srv/home/pokybuild/poky-slave/nightly-external-lsb/build/build/tmp/sysroots/mpc8315e-rdb -O2 -pipe -g -feliminate-unused-debug-types -D_GNU_SOURCE -I/usr/include/slang    -c -o textbox.o textbox.c
| powerpc-poky-linux-gcc -mcpu=603e  -mhard-float --sysroot=/srv/home/pokybuild/poky-slave/nightly-external-lsb/build/build/tmp/sysroots/mpc8315e-rdb -O2 -pipe -g -feliminate-unused-debug-types -D_GNU_SOURCE -I/usr/include/slang    -c -o scale.o scale.c
| powerpc-poky-linux-gcc -mcpu=603e  -mhard-float --sysroot=/srv/home/pokybuild/poky-slave/nightly-external-lsb/build/build/tmp/sysroots/mpc8315e-rdb -O2 -pipe -g -feliminate-unused-debug-types -D_GNU_SOURCE -I/usr/include/slang    -c -o grid.o grid.c
| powerpc-poky-linux-gcc -mcpu=603e  -mhard-float --sysroot=/srv/home/pokybuild/poky-slave/nightly-external-lsb/build/build/tmp/sysroots/mpc8315e-rdb -O2 -pipe -g -feliminate-unused-debug-types -D_GNU_SOURCE -I/usr/include/slang    -c -o windows.o windows.c
| powerpc-poky-linux-gcc -mcpu=603e  -mhard-float --sysroot=/srv/home/pokybuild/poky-slave/nightly-external-lsb/build/build/tmp/sysroots/mpc8315e-rdb -O2 -pipe -g -feliminate-unused-debug-types -D_GNU_SOURCE -I/usr/include/slang    -c -o buttonbar.o buttonbar.c
| powerpc-poky-linux-gcc -mcpu=603e  -mhard-float --sysroot=/srv/home/pokybuild/poky-slave/nighERROR: Function 'do_compile' failed (see /srv/home/pokybuild/poky-slave/nightly-external-lsb/build/build/tmp/work/ppc603e-poky-linux/libnewt-0.52.12-r0/temp/log.do_compile.8669 for further information)
| tly-external-lsb/build/build/tmp/sysroots/mpc8315e-rdb -O2 -pipe -g -feliminate-unused-debug-types -D_GNU_SOURCE -I/usr/include/slang    -c -o checkboxtree.o checkboxtree.c
| powerpc-poky-linux-gcc -mcpu=603e  -mhard-float --sysroot=/srv/home/pokybuild/poky-slave/nightly-external-lsb/build/build/tmp/sysroots/mpc8315e-rdb -O2 -pipe -g -feliminate-unused-debug-types -D_GNU_SOURCE -I/usr/include/slang    -c -o whiptail.o whiptail.c
| powerpc-poky-linux-gcc -mcpu=603e  -mhard-float --sysroot=/srv/home/pokybuild/poky-slave/nightly-external-lsb/build/build/tmp/sysroots/mpc8315e-rdb -O2 -pipe -g -feliminate-unused-debug-types -D_GNU_SOURCE -I/usr/include/slang    -c -o dialogboxes.o dialogboxes.c
| mkdir -p shared
| powerpc-poky-linux-gcc -mcpu=603e  -mhard-float --sysroot=/srv/home/pokybuild/poky-slave/nightly-external-lsb/build/build/tmp/sysroots/mpc8315e-rdb -fPIC -c -O2 -pipe -g -feliminate-unused-debug-types -D_GNU_SOURCE -I/usr/include/slang   -o shared/newt.o newt.c
| powerpc-poky-linux-gcc -mcpu=603e  -mhard-float --sysroot=/srv/home/pokybuild/poky-slave/nightly-external-lsb/build/build/tmp/sysroots/mpc8315e-rdb -fPIC -c -O2 -pipe -g -feliminate-unused-debug-types -D_GNU_SOURCE -I/usr/include/slang   -o shared/button.o button.c
| powerpc-poky-linux-gcc -mcpu=603e  -mhard-float --sysroot=/srv/home/pokybuild/poky-slave/nightly-external-lsb/build/build/tmp/sysroots/mpc8315e-rdb -fPIC -c -O2 -pipe -g -feliminate-unused-debug-types -D_GNU_SOURCE -I/usr/include/slang   -o shared/form.o form.c
| Assembler messages:
| Fatal error: can't create shared/button.o: No such file or directory
| powerpc-poky-linux-gcc -mcpu=603e  -mhard-float --sysroot=/srv/home/pokybuild/poky-slave/nightly-external-lsb/build/build/tmp/sysroots/mpc8315e-rdb -fPIC -c -O2 -pipe -g -feliminate-unused-debug-types -D_GNU_SOURCE -I/usr/include/slang   -o shared/checkbox.o checkbox.c
| powerpc-poky-linux-gcc -mcpu=603e  -mhard-float --sysroot=/srv/home/pokybuild/poky-slave/nightly-external-lsb/build/build/tmp/sysroots/mpc8315e-rdb -fPIC -c -O2 -pipe -g -feliminate-unused-debug-types -D_GNU_SOURCE -I/usr/include/slang   -o shared/entry.o entry.c
| powerpc-poky-linux-gcc -mcpu=603e  -mhard-float --sysroot=/srv/home/pokybuild/poky-slave/nightly-external-lsb/build/build/tmp/sysroots/mpc8315e-rdb -fPIC -c -O2 -pipe -g -feliminate-unused-debug-types -D_GNU_SOURCE -I/usr/include/slang   -o shared/label.o label.c
| powerpc-poky-linux-gcc -mcpu=603e  -mhard-float --sysroot=/srv/home/pokybuild/poky-slave/nightly-external-lsb/build/build/tmp/sysroots/mpc8315e-rdb -fPIC -c -O2 -pipe -g -feliminate-unused-debug-types -D_GNU_SOURCE -I/usr/include/slang   -o shared/listbox.o listbox.c
| powerpc-poky-linux-gcc -mcpu=603e  -mhard-float --sysroot=/srv/home/pokybuild/poky-slave/nightly-external-lsb/build/build/tmp/sysroots/mpc8315e-rdb -fPIC -c -O2 -pipe -g -feliminate-unused-debug-types -D_GNU_SOURCE -I/usr/include/slang   -o shared/scrollbar.o scrollbar.c
| powerpc-poky-linux-gcc -mcpu=603e  -mhard-float --sysroot=/srv/home/pokybuild/poky-slave/nightly-external-lsb/build/build/tmp/sysroots/mpc8315e-rdb -fPIC -c -O2 -pipe -g -feliminate-unused-debug-types -D_GNU_SOURCE -I/usr/include/slang   -o shared/textbox.o textbox.c
| make: *** [shared/button.o] Error 2
| make: *** Waiting for unfinished jobs....
| FATAL: oe_runmake failed
NOTE: package libnewt-0.52.12-r0: task do_compile: Failed

logs link:
http://autobuilder.pokylinux.org:8010/builders/nightly-external-lsb/builds/12/steps/shell_13/logs/stdio

thanks
Comment 6 Jiajun Xu 2011-04-18 01:51:18 UTC
It's a new bug, while the keymap issue is already fixed. Pls. report a new bug for libnewt.
Comment 7 liang li 2011-04-18 02:12:49 UTC
an new defect 995 has been opened to autobuilder build failure for mpc8315e-rdb:
http://bugzilla.pokylinux.org/show_bug.cgi?id=995
Comment 8 Saul Wold 2011-05-13 17:47:04 UTC
Are these still issues, I think this has been fixed now.

http://git.yoctoproject.org/cgit/cgit.cgi/poky/commit/?id=b0bf7ef11512219d2822647058db840fd8d45df0
Comment 9 liang li 2011-05-16 04:10:04 UTC
defect 995 has been verified, and in nightly build 20110513-1 no such error:
http://autobuilder.pokylinux.org/nightly/20110513-1/machines/qemu/qemuppc/
git info : 
1b159ff35d9f484e72afb8b19a9e69a2770d8379
branch :
bernard

change the status to verified.