Bug 959 - qt4-x11-free-4.7.1-r21.1: do_configure: Failed
Summary: qt4-x11-free-4.7.1-r21.1: do_configure: Failed
Status: VERIFIED FIXED
Alias: None
Product: OE-Core
Classification: Build System, Metadata & Runtime
Component: graphics (show other bugs)
Version: unspecified
Hardware: x86 Multiple
: Medium normal
Target Milestone: 1.1
Assignee: Saul Wold
QA Contact:
URL:
Whiteboard:
: 958 (view as bug list)
Depends on:
Blocks:
 
Reported: 2011-04-06 22:51 UTC by Dexuan Cui
Modified: 2011-04-12 19:10 UTC (History)
4 users (show)

See Also:
OS type for building Yocto: ---
Type of Regression: ---
Verified:
Documentation change: ---


Attachments

Note You need to log in before you can comment on or make changes to this bug.
Description Dexuan Cui 2011-04-06 22:51:32 UTC
http://autobuilder.yoctoproject.org:8010/builders/nightly-external/builds/91/steps/shell_15/logs/stdio

The build should be broken by some recent change.

| compiling libmng.cpp
| libmng.cpp:42:20: fatal error: libmng.h: No such file or directory
| compilation terminated.
| make: *** [libmng.o] Error 1
| libmng disabled.
| DB2 auto-detection... ()
| compiling db2.cpp
| db2.cpp:42:20: fatal error: sqlcli.h: No such file or directory
| compilation terminated.
| make: *** [db2.o] Error 1
| DB2 disabled.
| OCI auto-detection... ()
| compiling oci.cpp
| oci.cpp:42:17: fatal error: oci.h: No such file or directory
| compilation terminated.
| make: *** [oci.o] Error 1
| OCI disabled.
| SQLite2 auto-detection... ()
| compiling sqlite2.cpp
| sqlite2.cpp:42:20: fatal error: sqlite.h: No such file or directory
| compilation terminated.
| make: *** [sqlite2.o] Error 1
| SQLite2 disabled.
| unknown SQL driver: sqlite_symbian
| TDS auto-detection... ()
| compiling tds.cpp
| tds.cpp:42:22: fatal error: sybfront.h: No such file or directory
| compilation terminated.
| make: *** [tds.o] Error 1
| TDS disabled.
| POSIX iconv auto-detection... ()
| compiling iconv.cpp
| linking iconv
| POSIX iconv enabled.
| D-Bus auto-detection... ()
| compiling dbus.cpp
| linking dbus
| D-Bus enabled.
| Glib auto-detection... ()
| compiling glib.cpp
| glib.cpp: In function 'int main(int, char**)':
| glib.cpp:55:38: wERROR: Function 'do_configure' failed (see /srv/home/pokybuild/poky-slave/nightly-external/build/build/tmp/work/ppc603e-poky-linux/qt4-x11-free-4.7.1-r21.1/temp/log.do_configure.25338 for further information)
| arning: 'pollfd' is used uninitialized in this function
| linking glib
| Glib enabled.
| GStreamer auto-detection... ()
| compiling gstreamer.cpp
| gstreamer.cpp:53:5: warning: unused parameter 'argc'
| gstreamer.cpp:53:5: warning: unused parameter 'argv'
| linking gstreamer
| GStreamer enabled.
| ICD auto-detection... ()
| compiling icd.cpp
| icd.cpp:42:37: fatal error: libicd-network-wlan-dev.h: No such file or directory
| compilation terminated.
| make: *** [icd.o] Error 1
| ICD disabled.
| PulseAudio auto-detection... ()
| compiling pulseaudio.cpp
| pulseaudio.cpp:42:30: fatal error: pulse/pulseaudio.h: No such file or directory
| compilation terminated.
| make: *** [pulseaudio.o] Error 1
| PulseAudio disabled.
| Detecting broken X11 headers... (/srv/home/pokybuild/poky-slave/nightly-external/build/build/tmp/work/ppc603e-poky-linux/qt4-x11-free-4.7.1-r21.1/qt-everywhere-opensource-src-4.7.1/mkspecs/linux-oe-g++ yes /srv/home/pokybuild/poky-slave/nightly-external/build/build/tmp/work/ppc603e-poky-linux/qt4-x11-free-4.7.1-r21.1/qt-everywhere-opensource-src-4.7.1 /srv/home/pokybuild/poky-slave/nightly-external/build/build/tmp/work/ppc603e-poky-linux/qt4-x11-free-4.7.1-r21.1/qt-everywhere-opensource-src-4.7.1)
| X11 headers look good.
| XLib auto-detection... ()
| compiling xlib.cpp
| linking xlib
| XLib enabled.
| OpenGL auto-detection... ()
| compiling opengl.cpp
| opengl.cpp:42:19: fatal error: GL/gl.h: No such file or directory
| compilation terminated.
| make: *** [opengl.o] Error 1
| OpenGL disabled.
| OpenGL ES 2.x auto-detection... ()
| compiling opengles2.cpp
| opengles2.cpp:42:23: fatal error: GLES2/gl2.h: No such file or directory
| compilation terminated.
| make: *** [opengles2.o] Error 1
| OpenGL ES 2.x disabled.
| OpenGL ES 1.x auto-detection... ()
| compiling opengles1.cpp
| opengles1.cpp:42:21: fatal error: GLES/gl.h: No such file or directory
| compilation terminated.
| make: *** [opengles1.o] Error 1
| OpenGL ES 1.x disabled.
| All the OpenGL functionality tests failed!
Comment 1 Saul Wold 2011-04-08 15:07:54 UTC
*** Bug 958 has been marked as a duplicate of this bug. ***
Comment 2 Saul Wold 2011-04-08 15:08:18 UTC
I am working on a fix currently to add virtual/libgl to the DEPENDS, need to verify this will work for machines without a libgl (mesa) implementation correctly.
Comment 4 Saul Wold 2011-04-12 14:59:16 UTC
See above
Comment 5 Dexuan Cui 2011-04-12 19:10:12 UTC
(In reply to comment #3)
> http://git.pokylinux.org/cgit/cgit.cgi/poky/commit/?id=31bc011cf71749dd29192c6e90acb51bd68f90d5

I don't have the issue with the fix. 
VERIFY it.